{"text_format":"1","workbook":"xlsx","n_sheets":25,"sheets":["General Overview","OVERALL RATING","AOP Frontal MPDB","AOP Frontal FW","AOP Side MDB","AOP Side Pole","AOP Farside","AOP Whiplash","AOP Rescue","COP Dynamic","COP Vehicle Based","COP CRS Installation","COP OEM Information","VRU Headform","VRU Upper Legform","VRU Legform","VRU AEB Pedestrian","VRU AEB Bicyclist","VRU AEB Motorcyclist","SA OSM","SA SAS","SA AEB Car-to-Car","SA LSS","Datasheet","Version Control"],"not_rendered":{"charts":0,"images":383,"macros":1,"external_links":0,"defined_names":47,"comments":2,"pivot_tables":0},"unopened":[],"bounds":{"document_bytes":16777216,"sheet_cells":100000,"rows_first":2000,"rows_last":500,"rows_between":2000,"halvings":0,"cell_chars":16384,"cell_head_chars":4096},"cells_cut":0,"cells_raw":0,"read":"whole","date_system":"1900"}

{"sheet":"General Overview","index":0,"n_rows":171,"n_cols":52,"rows_kept":171,"cut":false,"hidden":false,"merged":[[50,1,50,3],[51,1,51,3],[39,1,39,3],[40,1,40,3],[41,1,41,3],[42,1,42,3],[43,1,43,3],[67,1,67,3],[68,1,68,3],[62,1,62,3],[63,1,63,3],[64,1,64,3],[66,1,66,3],[52,1,52,3],[55,1,55,3],[56,1,56,3],[57,1,57,3],[59,1,59,3],[47,1,47,3],[58,1,58,3],[54,1,54,3],[65,1,65,3],[28,1,28,3],[29,1,29,3],[30,1,30,3],[31,1,31,3],[44,1,44,3],[45,1,45,3],[46,1,46,3],[32,1,32,3],[14,1,14,4],[11,2,11,4],[3,2,3,4],[4,2,4,4],[5,2,5,4],[6,2,6,4],[7,2,7,4],[9,2,9,4],[8,2,8,4],[10,2,10,4],[12,2,12,3],[75,1,75,2],[75,3,75,4],[73,1,73,4],[74,1,74,4],[70,1,71,2],[70,3,70,6],[71,3,71,4],[72,1,72,2],[72,3,72,4],[13,2,13,4],[18,2,18,4],[49,1,49,6],[36,2,36,3],[23,1,23,3],[24,1,24,3],[25,1,25,3],[26,1,26,3],[15,2,15,3],[33,1,33,3],[34,1,34,3],[35,1,35,3],[38,1,38,3],[27,1,27,3],[88,1,88,2],[88,3,88,4],[87,1,87,2],[87,3,87,4],[86,3,86,4],[76,1,76,2],[76,3,76,4],[77,1,77,2],[77,3,77,4],[78,3,78,4],[79,1,79,2],[79,3,79,4],[80,1,80,2],[80,3,80,4],[100,1,100,2],[100,3,100,4],[96,1,96,2],[96,3,96,4],[97,1,97,2],[97,3,97,4],[98,1,98,2],[98,3,98,4],[92,1,92,2],[92,3,92,4],[94,1,94,2],[94,3,94,4],[95,1,95,2],[95,3,95,4],[1,1,1,4],[99,1,99,2],[99,3,99,4],[16,2,16,3],[17,2,17,3],[89,3,89,4],[90,1,90,2],[90,3,90,4],[91,1,91,2],[91,3,91,4],[93,1,93,2],[93,3,93,4],[85,1,85,2],[85,3,85,4],[86,1,86,2],[81,1,81,2],[81,3,81,4],[82,1,82,2],[82,3,82,4],[83,1,83,2],[83,3,83,4],[84,1,84,2],[84,3,84,4],[89,1,89,2]]}
["2024 v1.0",null,null,null,null,null,null,null,null,null,null,null,null,null,null,null,null,null,null,null,null,null,null,null,null,null,null,null,null,null,null,null,null,null,null,null,null,null,null,null,null,null,null,null,null,null,null,null,null,null,null,"v2023.1.1.1"]
[3,"VEHICLE SPECIFICATION",null,null,null,"YEAR OF TEST",2024,null,null,null,null,null,null,null,null,null,null,null,null,null,null,null,null,"3 door hatchback",null,null,null,null,null,null,null,null,null,null,null,null,null,null,null,null,null,null,null,null,null,null,null,null,null,null,null,"Changed formula for Pole_Capping D71 (mistake was comma instead of = sign)"]
[null,null,null,null,null,null,"BASE",null,null,null,null,null,null,null,null,null,null,null,null,null,null,null,null,null,null,null,null,null,null,null,null,null,null,null,null,null,null,null,null,null,null,null,null,null,null,null,null,null,null,null,null,"Added pre-requisite in AEB VRU Pedestrian CPRs (brakes not released unless path is clear)"]
[null,"Make",null,null,null,"Frontal MPDB test",{"$f":"IF(F3=\"\",\"\",_xlfn.CONCAT(F$3,\"-MP1\"))","v":""},null,"Imported from Matrix",null,null,null,null,null,null,null,null,null,null,null,null,null,null,"3 door wgon",null,null,null,null,null,null,null,null,null,null,null,null,null,null,null,null,null,null,null,null,null,null,null,null,null,null,null,"Corrected and expanded pre-requisites for DSM"]
[null,"Model",null,null,null,"Frontal FW test",{"$f":"IF(F3=\"\",\"\",_xlfn.CONCAT(F$3,\"-FW1\"))","v":""},null,null,null,null,null,null,null,null,null,null,null,null,null,null,null,null,"5 door wagon",null,null,null,null,null,null,null,null,null,null,null,null,null,null,null,null,null,null,null,null,null,null,null,null,null,null,null,"Changed drop-down of DSM from values to Yes, No, to account for decimal separator"]
[null,"Start VIN",null,null,null,"Side MDB test",{"$f":"IF(F3=\"\",\"\",_xlfn.CONCAT(F$3,\"-MD1\"))","v":""},null,null,null,null,null,null,null,null,null,null,null,null,null,null,null,null,null,null,null,null,null,null,null,null,null,null,null,null,null,null,null,null,null,null,null,null,null,null,null,null,null,null,null,null,"Frontal FW, cell D63 formula changed, limits for capping of chest changed from 42mm to 34mm (celld D23 and H23)"]
[null,"Kerb weight (kg)",null,null,null,"Side Pole test",{"$f":"IF(F3=\"\",\"\",_xlfn.CONCAT(F$3,IF(G8=\"\",\"-O2O1\",\"-PO1\")))","v":""},null,null,null,null,null,null,null,null,null,null,null,null,null,null,null,null,"5 door SUV",null,null,null,null,null,null,null,null,null,null,null,null,null,null,null,null,null,null,null,null,null,null,null,null,null,null,null,"Overall Rating, changed formulae for AEB Ped, Cyc and MC scores to check sum of subcomponent includes knee and tibia"]
[null,"Engine",null,null,null,"Side Pole O2O test",{"$f":"IF(F3=\"\",\"\",_xlfn.CONCAT(F$3,\"-O2O\"))","v":""},null,null,null,null,null,null,null,null,null,null,null,null,null,null,null,null,"3 door SUV",null,null,null,null,null,null,null,null,null,null,null,null,null,null,null,null,null,null,null,null,null,null,null,null,null,null,null,"Checked calculation of COP Vehicle Based Cell D27.  Protocol changed from 2020-2022, and calc correct"]
[null,"Trim level",null,null,null,"Whiplash tests",{"$f":"IF(F3=\"\",\"\",_xlfn.CONCAT(F$3,\"-WHL\"))","v":""},null,null,null,null,null,null,null,null,null,null,null,null,null,null,null,null,"5 door MPV",null,null,null,null,null,null,null,null,null,null,null,null,null,null,null,null,null,null,null,null,null,null,null,null,null,null,null,"AEMDB, formulae D76, E76 changed for pelvis submarining"]
[null,"Safety Pack",null,null,null,"Pedestrian tests",{"$f":"IF(F3=\"\",\"\",_xlfn.CONCAT(F$3,\"-PP\"))","v":""},null,null,null,null,null,null,null,null,null,null,null,null,null,null,null,null,null,null,null,null,null,null,null,null,null,null,null,null,null,null,null,null,null,null,null,null,null,null,null,null,null,null,null,null,"Formulae change in Rescue D17, D22, D27 and D32.  Now applies modifier if no data entered. Formula for belt unlatching corrected - 60N for front impacts and 100N for side impacts"]
[null,"Body Type",null,null,null,"AEB VRU Pedestrian tests",{"$f":"IF(F3=\"\",\"\",_xlfn.CONCAT(F$3,\"-AEBP\"))","v":""},null,null,null,null,null,null,null,null,null,null,null,null,null,null,null,null,null,null,null,null,null,null,null,null,null,null,null,null,null,null,null,null,null,null,null,null,null,null,null,null,null,null,null,null,"Rescue Advanced eCall formula changed (was correct for 2024, not 2023)"]
[null,"Full description",null,null,null,"AEB VRU Cyclist tests",{"$f":"IF(F3=\"\",\"\",_xlfn.CONCAT(F$3,\"-AEBB\"))","v":""},null,null,null,null,null,null,null,null,null,null,null,null,null,null,null,null,null,null,null,null,null,null,null,null,null,null,null,null,null,null,null,null,null,null,null,null,null,null,null,null,null,null,null,null,"COP Dynamic D7, F7 takes CRS names from General Overview"]
[null,"Release Date",null,null,null,"AEB VRU Motorcyclist  tests",{"$f":"IF(F3=\"\",\"\",_xlfn.CONCAT(F$3,\"-AEBB\"))","v":""},null,null,null,null,null,null,null,null,null,null,null,null,null,null,null,null,null,null,null,null,null,null,null,null,null,null,null,null,null,null,null,null,null,null,null,null,null,null,null,null,null,null,null,null,"OSM D9 H9 formulae simplified"]
[null,"Hand of drive",null,null,null,"OSM test",{"$f":"IF(F3=\"\",\"\",_xlfn.CONCAT(F$3,\"-OSM\"))","v":""},null,null,null,null,null,null,null,null,null,null,null,null,null,null,null,null,null,null,null,null,null,null,null,null,null,null,null,null,null,null,null,null,null,null,null,null,null,null,null,null,null,null,null,null,"OSM D18 formula corrected for 3 pass but expanded to cover many other requirements"]
[null,"Seat arrangement (incl. driver)",null,null,null,"SAS tests",{"$f":"IF(F3=\"\",\"\",_xlfn.CONCAT(F$3,\"-SAS\"))","v":""}]
[null,"front row",null,null,null,"AEB Car-to-Car tests",{"$f":"IF(F3=\"\",\"\",_xlfn.CONCAT(F$3,\"-AEBC\"))","v":""}]
[null,"second row",null,null,null,"LSS tests",{"$f":"IF(F3=\"\",\"\",_xlfn.CONCAT(F$3,\"-LSS\"))","v":""}]
[null,"third row"]
[null,"Vehicle class"]
[]
[null,"SAFETY EQUIPMENT"]
[]
[null,"ADULT OCCUPANT",null,null,"DRIVER","PASSENGER","REAR","ROW 3"]
[null,"FRONTAL"]
[null,"frontal airbag",null,null,null,null,null,"-"]
[null,"belt pretensioner",null,null,null,null,null,"-"]
[null,"belt loadlimiter",null,null,null,null,null,"-"]
[null,"knee airbag",null,null,null,null,null,"-"]
[null,"SIDE"]
[null,"side head airbag",null,null,null,null,null,"-"]
[null,"side chest airbag",null,null,null,null,null,"-"]
[null,"side pelvis airbag",null,null,null,null,null,"-"]
[null,"far-side centre airbag",null,null,null,null,{"$f":"IF(OR(E33=\"Standard\",F33=\"Standard\"),\"Standard\",IF(OR(E33=\"Optional not meeting fitment\",F33=\"Optional not meeting fitment\"),\"Optional not meeting fitment\",\"Not available\"))","v":"Not available"}]
[null,"RESCUE"]
[null,"Advanced eCall"]
[null,"MCB"]
[]
[null,"CHILD OCCUPANT",null,null,"DRIVER","PASSENGER","REAR","ROW 3"]
[null,"CHILD RESTRAINT SYSTEM"]
[null,"CRS used for testing"]
[null,"Q6"]
[null,"Q10"]
[null,"VEHICLE BASED"]
[null,"ISOFIX"]
[null,"i-Size"]
[null,"integrated CRS"]
[null,"airbag cut-off switch"]
[null,"Child Presence Detection"]
[]
[null,"VULNERABLE ROAD USER"]
[null,"ACTIVE PEDESTRIAN SYSTEM"]
[null,"deployable bonnet"]
[null,"pedestrian airbag"]
[null,"DOORING"]
[null,"Dooring Prevention"]
[null,"AEB"]
[null,"AEB Pedestrian"]
[null,"AEB Cyclist"]
[null,"AEB Motorcyclist"]
[null,"AEB Reverse"]
[]
[null,"SAFETY ASSIST",null,null,"DRIVER","PASSENGER","REAR","ROW 3"]
[null,"SAFETY ASSIST SYSTEMS"]
[null,"SBR",null,null,null,null,null,"-"]
[null,"Driver Monitoring"]
[null,"Fatigue/Distraction Monitoring"]
[null,"AEB Car-to-Car"]
[null,"Speed Assist System"]
[null,"Lane Support System"]
[]
[null,"PROTOCOLS"]
[null,null,null,"Protocol",null,"Version","Application"]
[null,"GENERAL"]
[null,"VEHICLE SPECIFICATION, SPONSORSHIP, TESTING AND RETESTING PROTOCOL",null,null,null,"7.1",2018]
[null,"EURO NCAP ASSESSMENT PROTOCOL - OVERALL RATING",null,null,null,"7.0.1",2016]
[null,"ADULT OCCUPANT PROTECTION"]
[null,null,null,"EURO NCAP ASSESSMENT PROTOCOL - AOP",null,"8.0.2",2018]
[null,null,null,"FRONTAL ODB TEST PROTOCOL",null,"7.1.2",2018]
[null,null,null,"FRONTAL FULL WIDTH TEST PROTOCOL",null,"1.0.2",2018]
[null,null,null,"SIDE BARRIER IMPACT TEST PROTOCOL",null,"7.1.1",2018]
[null,null,null,"SIDE POLE IMPACT TEST PROTOCOL",null,"7.0.2",2018]
[null,null,null,"WHIPLASH TESTING PROTOCOL",null,"3.2",2015]
[null,null,null,"REAR WHIPLASH TEST PROTOCOL",null,"1.0",2014]
[null,null,null,"SLED TEST PROCEDURE",null,"2.7",2010]
[null,null,null,"AEB TEST PROCEDURE",null,"2.0.1",2018]
[]
[null,"CHILD OCCUPANT PROTECTION"]
[null,null,null,"EURO NCAP ASSESSMENT PROTOCOL - COP",null,"7.2.1",2018]
[null,null,null,"COP TEST PROTOCOL",null,"7.2.1",2018]
[]
[null,"PEDESTRIAN PROTECTION"]
[null,null,null,"EURO NCAP ASSESSMENT PROTOCOL - PP",null,"9.0.2",2018]
[null,null,null,"PEDESTRIAN TEST PROTOCOL",null,"8.4",2018]
[null,null,null,"AEB VRU TEST PROTOCOL",null,"2.0.2",2018]
[]
[null,"SAFETY ASSIST"]
[null,null,null,"EURO NCAP ASSESSMENT PROTOCOL - SA",null,"8.0.1",2018]
[null,null,null,"SAS TEST PROTOCOL",null,"2.0.1",2018]
[null,null,null,"AEB TEST PROTOCOL",null,"2.0",2018]
[null,null,null,"LSS TEST PROTOCOL",null,"2.0.1",2018]
[]
[]
[]
[]
[]
[]
[]
[]
[]
[null,null,null,null,"Make","Vehicle class","CRS"]
[null,null,null,null,"Aiways","Supermini"]
[null,null,null,null,"Alfa Romeo","Small Family Car"]
[null,null,null,null,"Audi","Large Family Car"]
[null,null,null,null,"BMW","Executive"]
[null,null,null,null,"BYD","Small MPV"]
[null,null,null,null,"Chery","Large MPV"]
[null,null,null,null,"Chevrolet","Small Off-Road"]
[null,null,null,null,"Chrysler","Large Off-Road"]
[null,null,null,null,"Citroën","Roadster sports"]
[null,null,null,null,"Cupra","Pick-up"]
[null,null,null,null,"Dacia","Business and Family Vans"]
[null,null,null,null,"Daewoo"]
[null,null,null,null,"Daihatsu"]
[null,null,null,null,"Dodge"]
[null,null,null,null,"DS"]
[null,null,null,null,"FIAT"]
[null,null,null,null,"Ford"]
[null,null,null,null,"Geely Emgrand"]
[null,null,null,null,"Honda"]
[null,null,null,null,"Hyundai"]
[null,null,null,null,"Infiniti"]
[null,null,null,null,"Isuzu"]
[null,null,null,null,"Jaguar"]
[null,null,null,null,"Jeep"]
[null,null,null,null,"Kia"]
[null,null,null,null,"Lancia"]
[null,null,null,null,"Land Rover"]
[null,null,null,null,"Landwind"]
[null,null,null,null,"Lexus"]
[null,null,null,null,"Lucid"]
[null,null,null,null,"Maserati"]
[null,null,null,null,"Maxus"]
[null,null,null,null,"Mazda"]
[null,null,null,null,"Mercedes-Benz"]
[null,null,null,null,"MG"]
[null,null,null,null,"MINI"]
[null,null,null,null,"Mitsubishi"]
[null,null,null,null,"NIO"]
[null,null,null,null,"Nissan"]
[null,null,null,null,"Omoda"]
[null,null,null,null,"Opel"]
[null,null,null,null,"ORA"]
[null,null,null,null,"Peugeot"]
[null,null,null,null,"Polestar"]
[null,null,null,null,"Porsche"]
[null,null,null,null,"Proton"]
[null,null,null,null,"Qoros"]
[null,null,null,null,"Renault"]
[null,null,null,null,"Saab"]
[null,null,null,null,"Seat"]
[null,null,null,null,"Skoda"]
[null,null,null,null,"smart"]
[null,null,null,null,"Subaru"]
[null,null,null,null,"Suzuki"]
[null,null,null,null,"Tesla"]
[null,null,null,null,"Toyota"]
[null,null,null,null,"Volkswagen"]
[null,null,null,null,"Volvo"]
[null,null,null,null,"WEY"]
[null,null,null,null,"Xpeng"]
[null,null,null,null,"Zeekr"]

{"sheet":"OVERALL RATING","index":1,"n_rows":51,"n_cols":12,"rows_kept":51,"cut":false,"hidden":false,"merged":[[2,10,2,11],[50,1,50,5],[50,6,50,10],[40,7,40,10],[32,1,32,6],[43,1,49,5],[43,6,49,10],[40,1,40,2],[42,1,42,10],[32,7,32,10],[39,7,39,8],[39,9,39,10],[34,7,34,8],[34,9,34,10],[35,7,35,8],[35,9,35,10],[25,1,25,10],[15,2,15,3],[16,2,16,3],[16,4,16,5],[16,6,16,7],[20,2,20,3],[19,2,19,3],[21,2,21,3],[22,2,22,3],[23,2,23,3],[19,4,19,5],[20,4,20,5],[21,4,21,5],[22,4,22,5],[23,4,23,5],[26,1,31,2],[40,3,40,4],[26,3,31,4],[40,5,40,6],[26,5,31,6],[39,1,39,2],[39,3,39,4],[39,5,39,6],[34,1,34,2],[34,3,34,4],[34,5,34,6],[35,1,35,2],[35,3,35,4],[35,5,35,6],[4,2,4,3],[4,4,4,5],[13,6,13,7],[14,6,14,7],[14,4,14,5],[4,6,4,7],[5,2,5,3],[14,2,14,3],[13,2,13,3],[5,4,5,5],[5,6,5,7],[5,8,5,9],[16,8,16,9],[13,4,13,5],[15,6,15,7],[15,8,15,9],[13,8,13,9],[14,8,14,9],[15,4,15,5],[1,6,2,6],[1,7,2,9],[26,7,31,8],[26,9,31,10],[15,10,16,10],[4,8,4,9],[19,8,19,9],[20,8,20,9],[21,8,21,9],[22,8,22,9],[23,8,23,9],[19,6,19,7],[20,6,20,7],[21,6,21,7],[22,6,22,7],[23,6,23,7]]}
[]
[null,null,{"$f":"CONCATENATE('General Overview'!C4:E4,\" \",'General Overview'!C5)","v":" "}]
[null,null,{"$f":"CONCATENATE('General Overview'!C8,\" \",'General Overview'!C9,\", \",'General Overview'!C14)","v":" , "},null,null,null,null,null,null,null,{"$f":"IF(MPDB_Capping,\"MPDB Capped\",IF(SIDE_MDB_Capping,\"Side MDB Capped\",IF(POLE_Capping,\"Side Pole Capped\",IF(VRU_Capping,\"VRU Capped\",\"\"))))","v":"MPDB Capped"}]
[]
[null,null,"ADULT OCCUPANT\n",null,"CHILD OCCUPANT\n",null,"VULNERABLE ROAD USER\n",null,"SAFETY ASSIST\n"]
[null,null,{"$f":"ROUND(C14,1)","v":0},null,{"$f":"ROUND(E14,1)","v":0},null,{"$f":"ROUND(G14,1)","v":0},null,{"$f":"ROUND(I14,1)","v":0}]
[null,null,"Frontal Offset",{"$f":"'AOP Frontal MPDB'!D129","v":0},"Dynamic",{"$f":"IF(OR('General Overview'!C17=\"\",'General Overview'!C18=\"\",'General Overview'!C17>0,'General Overview'!C18>0),'COP Dynamic'!D71,\"\")","v":0},"Headforms",{"$f":"'VRU Headform'!T75","v":0},"OSM",{"$f":"'SA OSM'!D51","v":0}]
[null,null,"Frontal FW",{"$f":"'AOP Frontal FW'!D63","v":0},"Vehicle Based",{"$f":"'COP Vehicle Based'!D47","v":0},"Pelvis",{"$f":"'VRU Upper Legform'!G35","v":0},"SAS",{"$f":"IF('General Overview'!E68=\"Standard\",'SA SAS'!D72,0)","v":0}]
[null,null,"Side MDB",{"$f":"'AOP Side MDB'!D54","v":0},"CRS Installation",{"$f":"'COP CRS Installation'!H25","v":0},"Femur",{"$f":"'VRU Legform'!E32","v":0},"AEB Car-to-Car",{"$f":"IF('General Overview'!E67=\"Standard\",'SA AEB Car-to-Car'!D135,0)","v":0}]
[null,null,"Side Pole",{"$f":"'AOP Side Pole'!D73","v":0},null,null,"Knee & Tibia",{"$f":"'VRU Legform'!E36","v":0},"LSS",{"$f":"IF('General Overview'!E69=\"Standard\",'SA LSS'!D78,0)","v":0}]
[null,null,"Farside",{"$f":"IF(SUM(D9:D10)<10,0,'AOP Farside'!D70)","v":0},null,null,"AEB Pedestrian",{"$f":"IF(AND(SUM(H7:H10)>=18,'General Overview'!E57=\"Standard\"),'VRU AEB Pedestrian'!D94,0)","v":0}]
[null,null,"Whiplash",{"$f":"'AOP Whiplash'!D76","v":0},null,null,"AEB Cyclist",{"$f":"IF(AND(SUM(H7:H10)>=18,'General Overview'!E58=\"Standard\"),'VRU AEB Bicyclist'!D76,0)","v":0}]
[null,null,"Rescue",{"$f":"'AOP Rescue'!D74","v":-0.5},null,null,"AEB/LSS Motorcyclist",{"$f":"IF(AND(SUM(H7:H10)>=18,'General Overview'!E59=\"Standard\"),'VRU AEB Motorcyclist'!D71,0)","v":0}]
[null,"Total Score",{"$f":"MAX(0,SUM(D7:D13))","v":0},null,{"$f":"SUM(F7:F13)","v":0},null,{"$f":"SUM(H7:H13)","v":0},null,{"$f":"SUM(J7:J11)","v":0}]
[null,"Max Points available",40,null,49,null,63,null,18,null,"TOTAL"]
[null,"Normalised Score",{"$f":"INT(C14/C15*100)","v":0},null,{"$f":"INT(E14/E15*100)","v":0},null,{"$f":"INT(G14/G15*100)","v":0},null,{"$f":"INT(I14/I15*100)","v":0},null,{"$f":"INT(ROUND((C14/C15)*100,2)*C17+ROUND((E14/E15)*100,2)*E17+ROUND((G14/G15)*100,2)*G17+ROUND((I14/I15)*100,2)*I17)","v":0}]
[null,"Weight",0.4,null,0.2,null,0.2,null,0.2]
[null,null,null,{"$f":"C16/100","v":0},null,{"$f":"E16/100","v":0},null,{"$f":"G16/100","v":0},null,{"$f":"I16/100","v":0}]
[null,"RATING REQUIREMENTS 2023"]
[null,null,{"$f":"IF($C$16>=80,80,CONCATENATE(\"80 (\",ROUND(80/100*C$15-C$14,3),\"*)\"))","v":"80 (32*)"},null,{"$f":"IF($E$16>=80,80,CONCATENATE(\"80 (\",ROUND(80/100*E$15-E$14,3),\"*)\"))","v":"80 (39.2*)"},null,{"$f":"IF($G$16>=70,70,CONCATENATE(\"70 (\",ROUND(70/100*G$15-G$14,3),\"*)\"))","v":"70 (44.1*)"},null,{"$f":"IF($I$16>=70,70,CONCATENATE(\"70 (\",ROUND(70/100*I$15-I$14,3),\"*)\"))","v":"70 (12.6*)"},null,null,{"$f":"IF(AND($C$16>=$C20,$E$16>=$E20,$G$16>=$G20,$I$16>=$I20,NOT(OR(MPDB_Capping,FWRB_Capping,SIDE_MDB_Capping,POLE_Capping,VRU_Capping))),1,0)","v":0}]
[null,null,{"$f":"IF($C$16>=70,70,CONCATENATE(\"70 (\",ROUND(70/100*C$15-C$14,3),\"*)\"))","v":"70 (28*)"},null,{"$f":"IF($E$16>=70,70,CONCATENATE(\"70 (\",ROUND(70/100*E$15-E$14,3),\"*)\"))","v":"70 (34.3*)"},null,{"$f":"IF($G$16>=60,60,CONCATENATE(\"60 (\",ROUND(60/100*G$15-G$14,3),\"*)\"))","v":"60 (37.8*)"},null,{"$f":"IF($I$16>=60,60,CONCATENATE(\"60 (\",ROUND(60/100*I$15-I$14,3),\"*)\"))","v":"60 (10.8*)"},null,null,{"$f":"IF(AND($C$16>=$C21,$E$16>=$E21,$G$16>=$G21,$I$16>=$I21),1,0)","v":0}]
[null,null,{"$f":"IF($C$16>=60,60,CONCATENATE(\"60 (\",ROUND(60/100*C$15-C$14,3),\"*)\"))","v":"60 (24*)"},null,{"$f":"IF($E$16>=60,60,CONCATENATE(\"60 (\",ROUND(60/100*E$15-E$14,3),\"*)\"))","v":"60 (29.4*)"},null,{"$f":"IF($G$16>=50,50,CONCATENATE(\"50 (\",ROUND(50/100*G$15-G$14,3),\"*)\"))","v":"50 (31.5*)"},null,{"$f":"IF($I$16>=50,50,CONCATENATE(\"50 (\",ROUND(50/100*I$15-I$14,3),\"*)\"))","v":"50 (9*)"},null,null,{"$f":"IF(AND($C$16>=$C22,$E$16>=$E22,$G$16>=$G22,$I$16>=$I22),1,0)","v":0}]
[null,null,{"$f":"IF($C$16>=50,50,CONCATENATE(\"50 (\",ROUND(50/100*C$15-C$14,3),\"*)\"))","v":"50 (20*)"},null,{"$f":"IF($E$16>=50,50,CONCATENATE(\"50 (\",ROUND(50/100*E$15-E$14,3),\"*)\"))","v":"50 (24.5*)"},null,{"$f":"IF($G$16>=40,40,CONCATENATE(\"40 (\",ROUND(40/100*G$15-G$14,3),\"*)\"))","v":"40 (25.2*)"},null,{"$f":"IF($I$16>=40,40,CONCATENATE(\"40 (\",ROUND(40/100*I$15-I$14,3),\"*)\"))","v":"40 (7.2*)"},null,null,{"$f":"IF(AND($C$16>=$C23,$E$16>=$E23,$G$16>=$G23,$I$16>=$I23),1,0)","v":0}]
[null,null,{"$f":"IF($C$16>=40,40,CONCATENATE(\"40 (\",ROUND(40/100*C15-C$14,3),\"*)\"))","v":"40 (16*)"},null,{"$f":"IF($E$16>=40,40,CONCATENATE(\"40 (\",ROUND(40/100*E$15-E$14,3),\"*)\"))","v":"40 (19.6*)"},null,{"$f":"IF($G$16>=30,30,CONCATENATE(\"30 (\",ROUND(30/100*G$15-G$14,3),\"*)\"))","v":"30 (18.9*)"},null,{"$f":"IF($I$16>=30,30,CONCATENATE(\"30 (\",ROUND(30/100*I$15-I$14,3),\"*)\"))","v":"30 (5.4*)"},null,null,{"$f":"IF(AND($C$16>=$C24,$E$16>=$E24,$G$16>=$G24,$I$16>=$I24),1,0)","v":0}]
[null,null,"* Points in brackets indicate the number of additional points to be scored to reach that specific star level",null,null,null,null,null,null,null,null,{"$f":"SUM(L20:L24)","v":0}]
[null,"ADULT OCCUPANT"]
[]
[]
[]
[]
[]
[]
[null,"FRONTAL OFFSET IMPACT",null,null,null,null,null,"FRONTAL FW IMPACT"]
[]
[]
[]
[]
[]
[]
[]
[null,"WHIPLASH",null,"SIDE MDB IMPACT",null,"SIDE POLE IMPACT",null,"FAR SIDE IMPACT"]
[]
[null,"CHILD OCCUPANT"]
[]
[]
[]
[]
[]
[]
[]
[null,"FRONTAL IMPACT",null,null,null,null,"SIDE IMPACT"]

{"sheet":"AOP Frontal MPDB","index":2,"n_rows":1547,"n_cols":14,"rows_kept":1547,"cut":false,"hidden":false,"merged":[[396,1,396,4],[128,1,128,2],[128,3,128,6],[133,1,133,6],[119,3,119,6],[120,4,120,6],[121,4,121,6],[122,4,122,6],[125,3,125,6],[126,1,126,2],[126,3,126,6],[127,3,127,6],[117,1,117,2],[117,3,117,6],[110,1,110,2],[111,3,111,4],[111,5,111,6],[112,3,112,4],[112,5,112,6],[113,3,113,4],[113,5,113,6],[114,3,114,4],[114,5,114,6],[115,1,115,2],[115,3,115,4],[115,5,115,6],[108,5,108,6],[50,1,50,2],[56,1,56,2],[56,3,56,4],[56,5,56,6],[78,1,78,2],[78,3,78,4],[78,5,78,6],[88,1,88,2],[97,1,97,2],[106,1,106,2],[108,1,108,2],[108,3,108,4],[54,5,54,6],[33,1,33,2],[33,3,33,4],[33,5,33,6],[1,1,2,2],[1,3,2,4],[1,5,2,6],[3,1,3,2],[23,1,23,2],[133,8,133,13],[134,8,134,11],[134,12,134,13],[135,8,135,11],[135,12,135,13],[136,8,136,11],[136,12,136,13],[137,8,137,11],[137,12,137,13],[138,8,138,11],[138,12,138,13],[142,8,142,11],[143,8,143,11],[144,8,144,11],[145,12,145,13],[139,8,139,11],[139,12,139,13],[140,8,140,11],[140,12,140,13],[141,8,141,11],[141,12,141,13]]}
[3]
[null,"Frontal MPDB Test",null,"Driver",null,"Passenger"]
[]
[null,{"$f":"'General Overview'!G4","v":""},null,"Value","Points","Value","Points"]
[null,"HEAD"]
[null,null,"Steering wheel airbag present? "]
[null,null,"Peak resultant acceleration - g",null,{"$f":"IF(D6=\"Yes\",IF(D7<80,4,\"\"),IF(D6=\"No\",0,\"\"))","v":""},null,{"$f":"IF(F7=\"\",0,IF(F7<80,4,\"\"))","v":0}]
[null,null,"HIC15",null,{"$f":"IF(D6=\"Yes\",IF(D7<80,\"\",ROUND(Sliding_Scale(D8,500,700,4,0),Round)),0)","v":0},null,{"$f":"IF(F7<80,\"\",ROUND(Sliding_Scale(F8,500,700,4,0),Round))","v":""}]
[null,null,"Resultant Acc. 3 msec exeedence - g",null,{"$f":"IF(D6=\"Yes\",IF(D7<80,\"\",ROUND(Sliding_Scale(D9,72,80,4,0),Round)),IF(D6=\"No\",0,\"\"))","v":""},null,{"$f":"IF(F7<80,\"\",ROUND(Sliding_Scale(F9,72,80,4,0),Round))","v":""}]
[null,null,"Damage (-1,-2)",null,{"$f":"IF(D10>=0.47,-2,IF(D10>=0.42,-1,0))","v":0}]
[null,null,"For monitoring purpose"]
[null,null,"SUFEHM"]
[null,null,"BrIC"]
[null,null,"UBriC"]
[null,null,"HAIC"]
[null,null,"KTH"]
[null,null,"Airbag contact modifier (-1)",null,{"$f":"D17","v":0},null,{"$f":"F17","v":0}]
[null,null,"Hazardous airbag deployment modifier (-1)",null,{"$f":"D18","v":0},null,{"$f":"F18","v":0}]
[null,null,"Incorrect airbag deployment modifier (-1)",null,{"$f":"D19","v":0},null,{"$f":"F19","v":0}]
[null,null,"Steering wheel displacement (-1) mm",null,{"$f":"MIN(ROUND(Modifier_Sliding_Scale(D21,90,110,-1,0),Round),ROUND(Modifier_Sliding_Scale(D22,72,88,-1,0),Round),ROUND(Modifier_Sliding_Scale(ABS(D23),90,110,-1,0),Round))","v":0}]
[null,null,"Fore/aft displacement - mm",null,{"$f":"IF(D21>0,\"rearward\",IF(D21<0,\"forward\",\"\"))","v":""}]
[null,null,"Vertical displacement - mm",null,{"$f":"IF(D22>0,\"upward\",IF(D22<0,\"downward\",\"\"))","v":""}]
[null,null,"Lateral displacement - mm",null,{"$f":"IF(D23>0,\"left\",IF(D23<0,\"right\",\"\"))","v":""}]
[null,"Head assessment",null,null,{"$f":"MAX(IF(D6=\"Yes\",MIN(E7:E9)+SUM(E10,E17:E20),IF(D6=\"No\",0)))","v":0},null,{"$f":"MAX(MIN(G7:G9)+SUM(G17:G19),0)","v":0}]
[]
[null,"NECK"]
[null,null,"Shear level exceeded - kN",null,{"$f":"ROUND(Sliding_Scale(D27,1.9,3.1,4,0),Round)","v":0},null,{"$f":"ROUND(Sliding_Scale(F27,IF(F28<25,1.9-0.7*(F28/25),(IF(F28<35,1.2,IF(F28<45,1.2-0.1*(F28-35)/10,1.1)))),IF(F28<25,3.1-1.6*(F28/25),(IF(F28<35,1.5,IF(F28<45,1.5-0.4*(F28-35)/10,1.10000000000001)))),4,0),Round)","v":0}]
[null,null,"duration of exceedence - ms"]
[null,null,"Tension level exceeded - kN",null,{"$f":"ROUND(Sliding_Scale(D29,2.7,3.3,4,0),Round)","v":0},null,{"$f":"ROUND(Sliding_Scale(F29,IF(F30<35,2.7-0.4*(F30/35),(IF(F30<60,2.3-1.2*(F30-35)/25,1.1))),IF(F30<35,3.3-0.4*(F30/35),(IF(F30<60,2.9-1.8*(F30-35)/25,1.10000000000001))),4,0),Round)","v":0}]
[null,null,"duration of exceedence - ms"]
[null,null,"Extension - Nm",null,{"$f":"ROUND(Sliding_Scale(D31,42,57,4,0),Round)","v":0},null,{"$f":"ROUND(Sliding_Scale(F31,42,57,4,0),Round)","v":0}]
[null,"Neck assessment",null,null,{"$f":"MIN(E27,E29,E31)","v":0},null,{"$f":"MIN(G27,G29,G31)","v":0}]
[]
[null,"Head and Neck assessment",null,{"$f":"MIN(E24,E32)","v":0},null,{"$f":"MIN(G24,G32)","v":0}]
[]
[null,"CHEST"]
[null,null,"Compression upper left - mm"]
[null,null,"Compression upper right - mm"]
[null,null,"Compression lower left - mm"]
[null,null,"Compression lower right - mm"]
[null,null,"Chest D / Rmax",{"$f":"MAX(D37:D40)","v":0},{"$f":"IF(D41=0,0,ROUND(Sliding_Scale(D41,35,60,4,0),Round))","v":0}]
[null,null,"Chest D / PCA - monitoring"]
[null,null,"Chest D / TIC - monitoring"]
[null,null,"Compression - mm",null,null,null,{"$f":"ROUND(Sliding_Scale(F44,22,42,4,0),Round)","v":0}]
[null,null,"Viscous criterion - m/s",null,null,null,{"$f":"ROUND(Sliding_Scale(F45,0.5,1,4,0),Round)","v":0}]
[null,null,"Shoulder belt load - kN",null,{"$f":"IF(D46>6,-2,0)","v":0},null,{"$f":"IF(F46>6,-2,0)","v":0}]
[null,null,"Incorrect airbag deployment modifier (-1)",null,{"$f":"D47","v":0},null,{"$f":"F47","v":0}]
[null,null,"Steering wheel contact (-1) ",null,{"$f":"D48","v":0}]
[null,null,"A-Pillar displacement (-2) mm",null,{"$f":"ROUND(Modifier_Sliding_Scale(D49,100,200,-2,0),Round)","v":0}]
[null,null,"Unstable passenger compartment (-1)",null,{"$f":"D50","v":0}]
[null,"Chest assessment",null,null,{"$f":"MAX(E41+SUM(E46:E50),0)","v":0},null,{"$f":"MAX(MIN(G44:G45)+SUM(G46:G47),0)","v":0}]
[null,"ABDOMEN"]
[null,null,"Abdominal Compression left - mm",null,{"$f":"IF(D53=\"\",0,IF(D53>=88,0,4))","v":0}]
[null,null,"Abdominal Compression right - mm",null,{"$f":"IF(D54=\"\",0,IF(D54>=88,0,4))","v":0}]
[null,"Abdomen assessment",null,null,{"$f":"MIN(E53:E54)","v":0}]
[]
[null,"Chest and Abdomen assessment",null,{"$f":"MIN(E51:E54)","v":0},null,{"$f":"G51","v":0}]
[]
[null,"KNEE, FEMUR and PELVIS"]
[null,null,"Left Knee Slide - mm",null,{"$f":"ROUND(Sliding_Scale(D60,6,15,4,0),Round)","v":0},null,{"$f":"ROUND(Sliding_Scale(F60,6,15,4,0),Round)","v":0}]
[null,null,"Left Femur Compression level exceeded - kN",null,{"$f":"ROUND(Sliding_Scale(D61,3.8,IF(D62<11,9.07-1.51*D62/10,7.56),4,0),Round)","v":0},null,{"$f":"ROUND(Sliding_Scale(F61,3.8,IF(F62<11,9.07-1.51*F62/10,7.56),4,0),Round)","v":0}]
[null,null,"duration of exceedence - ms"]
[null,null,"Variable contact (-1) ",null,{"$f":"D63","v":0},null,{"$f":"F63","v":0}]
[null,null,"Concentrated loading (-1) ",null,{"$f":"D64","v":0},null,{"$f":"F64","v":0}]
[null,null,"Incorrect airbag deployment modifier (-1)",null,{"$f":"D65","v":0},null,{"$f":"F65","v":0}]
[null,"Left Knee and Femur assessment",null,null,{"$f":"MAX(MIN(E60:E61)+SUM(E63:E65),0)","v":0},null,{"$f":"MAX(MIN(G60:G61)+SUM(G63:G65),0)","v":0}]
[null,null,"Right Knee Slide - mm",null,{"$f":"ROUND(Sliding_Scale(D67,6,15,4,0),Round)","v":0},null,{"$f":"ROUND(Sliding_Scale(F67,6,15,4,0),Round)","v":0}]
[null,null,"Right Femur Compression level exceeded - kN",null,{"$f":"ROUND(Sliding_Scale(D68,3.8,IF(D69<11,9.07-1.51*D69/10,7.56),4,0),Round)","v":0},null,{"$f":"ROUND(Sliding_Scale(F68,3.8,IF(F69<11,9.07-1.51*F69/10,7.56),4,0),Round)","v":0}]
[null,null,"duration of exceedence - ms"]
[null,null,"Variable contact (-1) ",null,{"$f":"D70","v":0},null,{"$f":"F70","v":0}]
[null,null,"Concentrated loading (-1) ",null,{"$f":"D71","v":0},null,{"$f":"F71","v":0}]
[null,null,"Incorrect airbag deployment modifier (-1)",null,{"$f":"D72","v":0},null,{"$f":"F72","v":0}]
[null,"Right Knee and Femur assessment",null,null,{"$f":"MAX(MIN(E67:E68)+SUM(E70:E72),0)","v":0},null,{"$f":"MAX(MIN(G67:G68)+SUM(G70:G72),0)","v":0}]
[null,null,"Left Acetabulum Compression - kN",null,{"$f":"ROUND(Sliding_Scale(D74,3.28,4.1,4,0),Round)","v":0}]
[null,null,"Right Acetabulum Compression - kN",null,{"$f":"ROUND(Sliding_Scale(D75,3.28,4.1,4,0),Round)","v":0}]
[null,null,"Submarining modifier (-4)",null,{"$f":"IF(D76=\"Yes\",-4,0)","v":0}]
[null,"Pelvis assessment",null,null,{"$f":"MAX(0,MIN(E74:E75)+E76)","v":0}]
[]
[null,"Knee, Femur and Pelvis assessment",null,{"$f":"MIN(E66,E73,E77)","v":0},null,{"$f":"MIN(G66,G73)","v":0}]
[]
[null,"LOWER LEG"]
[null,null,"Left compression - kN",null,{"$f":"ROUND(Sliding_Scale(D82,2,8,4,0),Round)","v":0},null,{"$f":"ROUND(Sliding_Scale(F82,2,8,4,0),Round)","v":0}]
[null,null,"Left Upper Tibia Index ",null,{"$f":"ROUND(Sliding_Scale(D83,0.4,1.3,4,0),Round)","v":0},null,{"$f":"ROUND(Sliding_Scale(F83,0.4,1.3,4,0),Round)","v":0}]
[null,null,"Left Lower Tibia Index",null,{"$f":"ROUND(Sliding_Scale(D84,0.4,1.3,4,0),Round)","v":0},null,{"$f":"ROUND(Sliding_Scale(F84,0.4,1.3,4,0),Round)","v":0}]
[null,null,"Maximum pedal vertical displacement - mm",{"$f":"MAX(D86:D88)","v":0},{"$f":"ROUND(Modifier_Sliding_Scale(D85,72,88,-1,0),Round)","v":0}]
[null,null,"Brake Vertical displacement - mm",null,{"$f":"IF(D86=\"N/A\",\"\",IF(D86>0,\"upward\",IF(D86<0,\"downward\",\"\")))","v":""},"Brake"]
[null,null,"Clutch Vertical displacement - mm",null,{"$f":"IF(D87=\"N/A\",\"\",IF(D87>0,\"upward\",IF(D87<0,\"downward\",\"\")))","v":""},"Clutch"]
[null,null,"Accel Vertical displacement - mm",null,{"$f":"IF(D88=\"N/A\",\"\",IF(D88>0,\"upward\",IF(D88<0,\"downward\",\"\")))","v":""},"Accelerator"]
[null,"Left Lower Leg assessment",null,null,{"$f":"MAX(MIN(E82:E84)+E85,0)","v":0},null,{"$f":"MIN(G82:G84)","v":0}]
[]
[null,null,"Right compression - kN",null,{"$f":"ROUND(Sliding_Scale(D91,2,8,4,0),Round)","v":0},null,{"$f":"ROUND(Sliding_Scale(F91,2,8,4,0),Round)","v":0}]
[null,null,"Right Upper Tibia Index ",null,{"$f":"ROUND(Sliding_Scale(D92,0.4,1.3,4,0),Round)","v":0},null,{"$f":"ROUND(Sliding_Scale(F92,0.4,1.3,4,0),Round)","v":0}]
[null,null,"Right Lower Tibia Index",null,{"$f":"ROUND(Sliding_Scale(D93,0.4,1.3,4,0),Round)","v":0},null,{"$f":"ROUND(Sliding_Scale(F93,0.4,1.3,4,0),Round)","v":0}]
[null,null,"Maximum pedal vertical displacement - mm",{"$f":"D85","v":0},{"$f":"E85","v":0}]
[null,null,"Brake Vertical displacement - mm",{"$f":"IF(D86=\"\",\"\",D86)","v":""},{"$f":"E86","v":""}]
[null,null,"Clutch Vertical displacement - mm",{"$f":"IF(D87=\"\",\"\",D87)","v":""},{"$f":"E87","v":""}]
[null,null,"Accel Vertical displacement - mm",{"$f":"IF(D88=\"\",\"\",D88)","v":""},{"$f":"E88","v":""}]
[null,"Right Lower Leg assessment",null,null,{"$f":"MAX(MIN(E91:E93)+E94,0)","v":0},null,{"$f":"MIN(G91:G93)","v":0}]
[]
[null,"FOOT and ANKLE"]
[null,null,"Maximum pedal horizontal displacement - mm",{"$f":"MAX(D102:D104)","v":0},{"$f":"IF(COUNTIF(D102:D104,\"\")=3,0,ROUND(Sliding_Scale(D101,100,200,4,0),Round))","v":0}]
[null,null,"Brake Horizontal displacement - mm",null,{"$f":"IF(D102=\"N/A\",\"\",IF(D102>0,\"rearward\",IF(D102<0,\"forward\",\"\")))","v":""},"Brake"]
[null,null,"Clutch Horizontal displacement - mm",null,{"$f":"IF(D103=\"N/A\",\"\",IF(D103>0,\"rearward\",IF(D103<0,\"forward\",\"\")))","v":""},"Clutch"]
[null,null,"Accel Horizontal displacement - mm",null,{"$f":"IF(D104=\"N/A\",\"\",IF(D104>0,\"rearward\",IF(D104<0,\"forward\",\"\")))","v":""},"Accelerator"]
[null,null,"Footwell Rupture (-1)",null,{"$f":"D105","v":0}]
[null,null,"Pedal Blocking (-1)",null,{"$f":"ROUND(Sliding_Scale(D106,50,175,0,-1),Round)","v":0}]
[null,"Foot and Ankle assessment",null,null,{"$f":"MAX(E101+E105+E106,0)","v":0}]
[]
[null,"Lower Leg, Foot and Ankle assessment",null,{"$f":"MIN(E89,E98,E107)","v":0},null,{"$f":"MIN(G89,G98)","v":0}]
[]
[null,"SUMMARY"]
[null,null,"Head and Neck assessment",{"$f":"D34","v":0},null,{"$f":"F34","v":0}]
[null,null,"Chest assessment",{"$f":"D57","v":0},null,{"$f":"F57","v":0}]
[null,null,"Knee, Femur and Pelvis assessment",{"$f":"D79","v":0},null,{"$f":"F79","v":0}]
[null,null,"Lower Leg, Foot and Ankle Assessment",{"$f":"D109","v":0},null,{"$f":"F109","v":0}]
[null,"DUMMY SCORE",null,{"$f":"SUM(D112:E115)","v":0},null,{"$f":"SUM(F112:G115)","v":0}]
[]
[null,"Door Opening",null,0]
[]
[null,"COMPATIBILITY"]
[null,null,"Standard Deviation",{"$f":"IF(COUNTIF(M148:M1547,\"\")>0,\"\",STDEV(N148:N1547))","v":""},{"$f":"IF(COUNTIF(M148:M1547,\"\")>0,\"Enter X-deformation\",((IF((8-2-2)*(25-D122)/(25-40)+2<2,2,IF((8-2-2)*(25-D122)/(25-40)+2>8-2,8-2,(8-2-2)*(25-D122)/(25-40)+2)))*-1)*(IF((1)*(50-D121)/(50-150)<0,0,IF((1)*(50-D121)/(-100)+0>1,1,(1)*(50-D121)/(-100)))))","v":"Enter X-deformation"}]
[null,null,"Trolley OLC - g",null,{"$f":"ROUND(Sliding_Scale(D122,25,40,0,-2),Round)","v":0}]
[null,null,"Bottoming out",{"$f":"IF(COUNTIF(N148:N1547,\">630\")>4,\"Yes\",\"No\")","v":"No"},{"$f":"IF(D123=\"Yes\", -2,0)","v":0}]
[null,null,"Vehicle LHS B-pillar OLC - g"]
[null,null,"Vehicle RHS B-pillar OLC - g"]
[]
[null,"Compatibility assessment",null,{"$f":"MAX(-8,SUM(E121:E123))","v":0}]
[null,null,null,{"$f":"IF(OR(D112=0,F112=0,D113=0,F113=0,'COP Dynamic'!E23=0,'COP Dynamic'!G23=0,'COP Dynamic'!E38=0,'COP Dynamic'!G33=0),TRUE,FALSE)","v":true}]
[null,"TOTAL FRONTAL MPDB",null,{"$f":"MAX(IF(OR(E7=0,E8=0,E9=0,G7=0,G8=0,G9=0,E27=0,E31=0,E29=0,G27=0,G29=0,G31=0,E41=0,G44=0,G45=0),0,(MIN(D112,F112)+MIN(D113,F113)+MIN(D114,F114)+MIN(D115,F115)+D118+D127)/2),0)","v":0}]
[]
[]
[]
[]
[null,"DUMMY MEASUREMENTS",null,null,null,null,null,null,"BARRIER SCAN"]
[null,"Head",null,null,null,null,null,null,"Vehicle"]
[null,"Ax","Max",null,null,null,null,null,"Width"]
[null,null,"Min",null,null,null,null,null,"Hand of Drive"]
[null,"Ay","Max"]
[null,null,"Min",null,null,null,null,null,"Assessment Zone"]
[null,"Az","Max",null,null,null,null,null,"Width",null,null,null,{"$f":"M136*0.45","v":0}]
[null,null,"Min",null,null,null,null,null,"Nr of colmns",null,null,null,{"$f":"FLOOR(M140/20,1)-10","v":-10}]
[null,"Wx","Max"]
[null,null,"Min",null,null,null,null,null,"Coordinates",null,null,null,{"$f":"IF(M137=\"RHD\",11,50-10-M141+1)","v":51},{"$f":"M143+M141-1","v":40}]
[null,"Wy","Max",null,null,null,null,null,25,null,null,null,{"$f":"CONCATENATE((I144-1)*20+10,\" , \",-(M143-1)*20-10)","v":"490 , -1010"},{"$f":"CONCATENATE((I144-1)*20+10,\" , \",-(N143-1)*20-10)","v":"490 , -790"}]
[null,null,"Min",null,null,null,null,null,6,null,null,null,{"$f":"CONCATENATE((I145-1)*20+10,\" , \",-(M143-1)*20-10)","v":"110 , -1010"},{"$f":"CONCATENATE((I145-1)*20+10,\" , \",-(N143-1)*20-10)","v":"110 , -790"}]
[null,"Wz","Max",null,null,null,null,null,"Y,Z-coordinates",null,null,null,"X-deformation"]
[null,null,"Min",null,null,null,null,null,"Coordinates",null,"Row","Column","All","In Zone"]
[null,"Skull spring",null,null,null,null,null,null,"-10,550",null,{"$f":"1+(RIGHT(I148,LEN(I148)-FIND(\",\",I148))-10)/20","v":28},{"$f":"1+((LEFT(I148,FIND(\",\",I148)-1)*-1)-10)/20","v":1},null,{"$f":"IF(AND(K148<=$I$144,K148>=$I$145,L148>=$M$143,L148<=$N$143),MIN(ROUND(M148,2),633),\"\")","v":""}]
[null,"Fz front","Max",null,null,null,null,null,"-10,530",null,{"$f":"1+(RIGHT(I149,LEN(I149)-FIND(\",\",I149))-10)/20","v":27},{"$f":"1+((LEFT(I149,FIND(\",\",I149)-1)*-1)-10)/20","v":1},null,{"$f":"IF(AND(K149<=$I$144,K149>=$I$145,L149>=$M$143,L149<=$N$143),MIN(ROUND(M149,2),633),\"\")","v":""}]
[null,null,"Min",null,null,null,null,null,"-10,510",null,26,1,null,""]
[null,"Fz rear","Max",null,null,null,null,null,"-10,490",null,25,1,null,""]
[null,null,"Min",null,null,null,null,null,"-10,470",null,24,1,null,""]
[null,"SUFEHM","value",null,null,null,null,null,"-10,450",null,23,1,null,""]
[null,"BrIC","value",null,null,null,null,null,"-10,430",null,22,1,null,""]
[null,"Neck",null,null,null,null,null,null,"-10,410",null,21,1,null,""]
[null,"Fx","Max",null,null,null,null,null,"-10,390",null,20,1,null,""]
[null,null,"Min",null,null,null,null,null,"-10,370",null,19,1,null,""]
[null,"Fy","Max",null,null,null,null,null,"-10,350",null,18,1,null,""]
[null,null,"Min",null,null,null,null,null,"-10,330",null,17,1,null,""]
[null,"Fz","Max",null,null,null,null,null,"-10,310",null,16,1,null,""]
[null,null,"Min",null,null,null,null,null,"-10,290",null,15,1,null,""]
[null,"Mx","Max",null,null,null,null,null,"-10,270",null,14,1,null,""]
[null,null,"Min",null,null,null,null,null,"-10,250",null,13,1,null,""]
[null,"My","Max",null,null,null,null,null,"-10,230",null,12,1,null,""]
[null,null,"Min",null,null,null,null,null,"-10,210",null,11,1,null,""]
[null,"Mz","Max",null,null,null,null,null,"-10,190",null,10,1,null,""]
[null,null,"Min",null,null,null,null,null,"-10,170",null,9,1,null,""]
[null,"Clavicle left inner",null,null,null,null,null,null,"-10,150",null,8,1,null,""]
[null,"Fx","Max",null,null,null,null,null,"-10,130",null,7,1,null,""]
[null,null,"Min",null,null,null,null,null,"-10,110",null,6,1,null,""]
[null,"Fy","Max",null,null,null,null,null,"-10,90",null,5,1,null,""]
[null,null,"Min",null,null,null,null,null,"-10,70",null,4,1,null,""]
[null,"Fz","Max",null,null,null,null,null,"-10,50",null,3,1,null,""]
[null,"Clavicle left outer",null,null,null,null,null,null,"-10,30",null,2,1,null,""]
[null,"Fx","Max",null,null,null,null,null,"-10,10",null,1,1,null,""]
[null,null,"Min",null,null,null,null,null,"-30,550",null,28,2,null,""]
[null,"Fy","Max",null,null,null,null,null,"-30,530",null,27,2,null,""]
[null,null,"Min",null,null,null,null,null,"-30,510",null,26,2,null,""]
[null,"Fz","Max",null,null,null,null,null,"-30,490",null,25,2,null,""]
[null,"Clavicle right inner",null,null,null,null,null,null,"-30,470",null,24,2,null,""]
[null,"Fx","Max",null,null,null,null,null,"-30,450",null,23,2,null,""]
[null,null,"Min",null,null,null,null,null,"-30,430",null,22,2,null,""]
[null,"Fy","Max",null,null,null,null,null,"-30,410",null,21,2,null,""]
[null,null,"Min",null,null,null,null,null,"-30,390",null,20,2,null,""]
[null,"Fz","Max",null,null,null,null,null,"-30,370",null,19,2,null,""]
[null,"Clavicle right outer",null,null,null,null,null,null,"-30,350",null,18,2,null,""]
[null,"Fx","Max",null,null,null,null,null,"-30,330",null,17,2,null,""]
[null,null,"Min",null,null,null,null,null,"-30,310",null,16,2,null,""]
[null,"Fy","Max",null,null,null,null,null,"-30,290",null,15,2,null,""]
[null,null,"Min",null,null,null,null,null,"-30,270",null,14,2,null,""]
[null,"Fz","Max",null,null,null,null,null,"-30,250",null,13,2,null,""]
[null,"Chest left upper",null,null,null,null,null,null,"-30,230",null,12,2,null,""]
[null,"Dx","Max",null,null,null,null,null,"-30,210",null,11,2,null,""]
[null,null,"Min",null,null,null,null,null,"-30,190",null,10,2,null,""]
[null,"Dy","Max",null,null,null,null,null,"-30,170",null,9,2,null,""]
[null,null,"Min",null,null,null,null,null,"-30,150",null,8,2,null,""]
[null,"Dz","Max",null,null,null,null,null,"-30,130",null,7,2,null,""]
[null,null,"Min",null,null,null,null,null,"-30,110",null,6,2,null,""]
[null,"Dchest","Max",null,null,null,null,null,"-30,90",null,5,2,null,""]
[null,null,"Min",null,null,null,null,null,"-30,70",null,4,2,null,""]
[null,"αy","Max",null,null,null,null,null,"-30,50",null,3,2,null,""]
[null,null,"Min",null,null,null,null,null,"-30,30",null,2,2,null,""]
[null,"αz","Max",null,null,null,null,null,"-30,10",null,1,2,null,""]
[null,null,"Min",null,null,null,null,null,"-50,550",null,28,3,null,""]
[null,"Chest right upper",null,null,null,null,null,null,"-50,530",null,27,3,null,""]
[null,"Dx","Max",null,null,null,null,null,"-50,510",null,26,3,null,""]
[null,null,"Min",null,null,null,null,null,"-50,490",null,25,3,null,""]
[null,"Dy","Max",null,null,null,null,null,"-50,470",null,24,3,null,""]
[null,null,"Min",null,null,null,null,null,"-50,450",null,23,3,null,""]
[null,"Dz","Max",null,null,null,null,null,"-50,430",null,22,3,null,""]
[null,null,"Min",null,null,null,null,null,"-50,410",null,21,3,null,""]
[null,"Dchest","Max",null,null,null,null,null,"-50,390",null,20,3,null,""]
[null,null,"Min",null,null,null,null,null,"-50,370",null,{"$f":"1+(RIGHT(I213,LEN(I213)-FIND(\",\",I213))-10)/20","v":19},{"$f":"1+((LEFT(I213,FIND(\",\",I213)-1)*-1)-10)/20","v":3},null,{"$f":"IF(AND(K213<=$I$144,K213>=$I$145,L213>=$M$143,L213<=$N$143),MIN(ROUND(M213,2),633),\"\")","v":""}]
[null,"αy","Max",null,null,null,null,null,"-50,350",null,18,3,null,""]
[null,null,"Min",null,null,null,null,null,"-50,330",null,17,3,null,""]
[null,"αz","Max",null,null,null,null,null,"-50,310",null,16,3,null,""]
[null,null,"Min",null,null,null,null,null,"-50,290",null,15,3,null,""]
[null,"Chest left lower",null,null,null,null,null,null,"-50,270",null,14,3,null,""]
[null,"Dx","Max",null,null,null,null,null,"-50,250",null,13,3,null,""]
[null,null,"Min",null,null,null,null,null,"-50,230",null,12,3,null,""]
[null,"Dy","Max",null,null,null,null,null,"-50,210",null,11,3,null,""]
[null,null,"Min",null,null,null,null,null,"-50,190",null,10,3,null,""]
[null,"Dz","Max",null,null,null,null,null,"-50,170",null,9,3,null,""]
[null,null,"Min",null,null,null,null,null,"-50,150",null,8,3,null,""]
[null,"Dchest","Max",null,null,null,null,null,"-50,130",null,7,3,null,""]
[null,null,"Min",null,null,null,null,null,"-50,110",null,6,3,null,""]
[null,"αy","Max",null,null,null,null,null,"-50,90",null,5,3,null,""]
[null,null,"Min",null,null,null,null,null,"-50,70",null,4,3,null,""]
[null,"αz","Max",null,null,null,null,null,"-50,50",null,3,3,null,""]
[null,null,"Min",null,null,null,null,null,"-50,30",null,2,3,null,""]
[null,"Chest right lower",null,null,null,null,null,null,"-50,10",null,1,3,null,""]
[null,"Dx","Max",null,null,null,null,null,"-70,550",null,28,4,null,""]
[null,null,"Min",null,null,null,null,null,"-70,530",null,27,4,null,""]
[null,"Dy","Max",null,null,null,null,null,"-70,510",null,26,4,null,""]
[null,null,"Min",null,null,null,null,null,"-70,490",null,25,4,null,""]
[null,"Dz","Max",null,null,null,null,null,"-70,470",null,24,4,null,""]
[null,null,"Min",null,null,null,null,null,"-70,450",null,23,4,null,""]
[null,"Dchest","Max",null,null,null,null,null,"-70,430",null,22,4,null,""]
[null,null,"Min",null,null,null,null,null,"-70,410",null,21,4,null,""]
[null,"αy","Max",null,null,null,null,null,"-70,390",null,20,4,null,""]
[null,null,"Min",null,null,null,null,null,"-70,370",null,19,4,null,""]
[null,"αz","Max",null,null,null,null,null,"-70,350",null,18,4,null,""]
[null,null,"Min",null,null,null,null,null,"-70,330",null,17,4,null,""]
[null,"Sternum",null,null,null,null,null,null,"-70,310",null,16,4,null,""]
[null,"Ax","Max",null,null,null,null,null,"-70,290",null,15,4,null,""]
[null,null,"Min",null,null,null,null,null,"-70,270",null,14,4,null,""]
[null,"T1 ",null,null,null,null,null,null,"-70,250",null,13,4,null,""]
[null,"Ax","Max",null,null,null,null,null,"-70,230",null,12,4,null,""]
[null,null,"Min",null,null,null,null,null,"-70,210",null,11,4,null,""]
[null,"Ay","Max",null,null,null,null,null,"-70,190",null,10,4,null,""]
[null,null,"Min",null,null,null,null,null,"-70,170",null,9,4,null,""]
[null,"Az","Max",null,null,null,null,null,"-70,150",null,8,4,null,""]
[null,null,"Min",null,null,null,null,null,"-70,130",null,7,4,null,""]
[null,"resultant","Max",null,null,null,null,null,"-70,110",null,6,4,null,""]
[null,null,"Min",null,null,null,null,null,"-70,90",null,5,4,null,""]
[null,"T4",null,null,null,null,null,null,"-70,70",null,4,4,null,""]
[null,"Ax","Max",null,null,null,null,null,"-70,50",null,3,4,null,""]
[null,null,"Min",null,null,null,null,null,"-70,30",null,2,4,null,""]
[null,"Ay","Max",null,null,null,null,null,"-70,10",null,1,4,null,""]
[null,null,"Min",null,null,null,null,null,"-90,550",null,28,5,null,""]
[null,"Az","Max",null,null,null,null,null,"-90,530",null,27,5,null,""]
[null,null,"Min",null,null,null,null,null,"-90,510",null,26,5,null,""]
[null,"resultant","Max",null,null,null,null,null,"-90,490",null,25,5,null,""]
[null,null,"Min",null,null,null,null,null,"-90,470",null,24,5,null,""]
[null,"T12",null,null,null,null,null,null,"-90,450",null,23,5,null,""]
[null,"Ax","Max",null,null,null,null,null,"-90,430",null,22,5,null,""]
[null,null,"Min",null,null,null,null,null,"-90,410",null,21,5,null,""]
[null,"Ay","Max",null,null,null,null,null,"-90,390",null,20,5,null,""]
[null,null,"Min",null,null,null,null,null,"-90,370",null,19,5,null,""]
[null,"Az","Max",null,null,null,null,null,"-90,350",null,18,5,null,""]
[null,null,"Min",null,null,null,null,null,"-90,330",null,17,5,null,""]
[null,"resultant","Max",null,null,null,null,null,"-90,310",null,16,5,null,""]
[null,null,"Min",null,null,null,null,null,"-90,290",null,15,5,null,""]
[null,"Fx","Max",null,null,null,null,null,"-90,270",null,14,5,null,""]
[null,null,"Min",null,null,null,null,null,"-90,250",null,13,5,null,""]
[null,"Fy","Max",null,null,null,null,null,"-90,230",null,12,5,null,""]
[null,null,"Min",null,null,null,null,null,"-90,210",null,{"$f":"1+(RIGHT(I277,LEN(I277)-FIND(\",\",I277))-10)/20","v":11},{"$f":"1+((LEFT(I277,FIND(\",\",I277)-1)*-1)-10)/20","v":5},null,{"$f":"IF(AND(K277<=$I$144,K277>=$I$145,L277>=$M$143,L277<=$N$143),MIN(ROUND(M277,2),633),\"\")","v":""}]
[null,"Fz","Max",null,null,null,null,null,"-90,190",null,10,5,null,""]
[null,null,"Min",null,null,null,null,null,"-90,170",null,9,5,null,""]
[null,"Mx","Max",null,null,null,null,null,"-90,150",null,8,5,null,""]
[null,null,"Min",null,null,null,null,null,"-90,130",null,7,5,null,""]
[null,"My","Max",null,null,null,null,null,"-90,110",null,6,5,null,""]
[null,null,"Min",null,null,null,null,null,"-90,90",null,5,5,null,""]
[null,"Abdomen",null,null,null,null,null,null,"-90,70",null,4,5,null,""]
[null,"Ax","Max",null,null,null,null,null,"-90,50",null,3,5,null,""]
[null,null,"Min",null,null,null,null,null,"-90,30",null,2,5,null,""]
[null,"Abdomen left",null,null,null,null,null,null,"-90,10",null,1,5,null,""]
[null,"Dx","Max",null,null,null,null,null,"-110,550",null,28,6,null,""]
[null,null,"Min",null,null,null,null,null,"-110,530",null,27,6,null,""]
[null,"Dy","Max",null,null,null,null,null,"-110,510",null,26,6,null,""]
[null,null,"Min",null,null,null,null,null,"-110,490",null,25,6,null,""]
[null,"Dz","Max",null,null,null,null,null,"-110,470",null,24,6,null,""]
[null,null,"Min",null,null,null,null,null,"-110,450",null,23,6,null,""]
[null,"Dabdomen","Max",null,null,null,null,null,"-110,430",null,22,6,null,""]
[null,null,"Min",null,null,null,null,null,"-110,410",null,21,6,null,""]
[null,"αy","Max",null,null,null,null,null,"-110,390",null,20,6,null,""]
[null,null,"Min",null,null,null,null,null,"-110,370",null,19,6,null,""]
[null,"αz","Max",null,null,null,null,null,"-110,350",null,18,6,null,""]
[null,null,"Min",null,null,null,null,null,"-110,330",null,17,6,null,""]
[null,"Abdomen right",null,null,null,null,null,null,"-110,310",null,16,6,null,""]
[null,"Dx","Max",null,null,null,null,null,"-110,290",null,15,6,null,""]
[null,null,"Min",null,null,null,null,null,"-110,270",null,14,6,null,""]
[null,"Dy","Max",null,null,null,null,null,"-110,250",null,13,6,null,""]
[null,null,"Min",null,null,null,null,null,"-110,230",null,12,6,null,""]
[null,"Dz","Max",null,null,null,null,null,"-110,210",null,11,6,null,""]
[null,null,"Min",null,null,null,null,null,"-110,190",null,10,6,null,""]
[null,"Dabdomen","Max",null,null,null,null,null,"-110,170",null,9,6,null,""]
[null,null,"Min",null,null,null,null,null,"-110,150",null,8,6,null,""]
[null,"αy","Max",null,null,null,null,null,"-110,130",null,7,6,null,""]
[null,null,"Min",null,null,null,null,null,"-110,110",null,6,6,null,""]
[null,"αz","Max",null,null,null,null,null,"-110,90",null,5,6,null,""]
[null,null,"Min",null,null,null,null,null,"-110,70",null,4,6,null,""]
[null,"Pelvis",null,null,null,null,null,null,"-110,50",null,3,6,null,""]
[null,"Ax","Max",null,null,null,null,null,"-110,30",null,2,6,null,""]
[null,null,"Min",null,null,null,null,null,"-110,10",null,1,6,null,""]
[null,"Ay","Max",null,null,null,null,null,"-130,550",null,28,7,null,""]
[null,null,"Min",null,null,null,null,null,"-130,530",null,27,7,null,""]
[null,"Az","Max",null,null,null,null,null,"-130,510",null,26,7,null,""]
[null,null,"Min",null,null,null,null,null,"-130,490",null,25,7,null,""]
[null,"Iliac left",null,null,null,null,null,null,"-130,470",null,24,7,null,""]
[null,"Fx","Max",null,null,null,null,null,"-130,450",null,23,7,null,""]
[null,null,"Min",null,null,null,null,null,"-130,430",null,22,7,null,""]
[null,"My","Max",null,null,null,null,null,"-130,410",null,21,7,null,""]
[null,null,"Min",null,null,null,null,null,"-130,390",null,20,7,null,""]
[null,"Iliac right",null,null,null,null,null,null,"-130,370",null,19,7,null,""]
[null,"Fx","Max",null,null,null,null,null,"-130,350",null,18,7,null,""]
[null,null,"Min",null,null,null,null,null,"-130,330",null,17,7,null,""]
[null,"My","Max",null,null,null,null,null,"-130,310",null,16,7,null,""]
[null,null,"Min",null,null,null,null,null,"-130,290",null,15,7,null,""]
[null,"Acetabulum left",null,null,null,null,null,null,"-130,270",null,14,7,null,""]
[null,"Fx","Max",null,null,null,null,null,"-130,250",null,13,7,null,""]
[null,null,"Min",null,null,null,null,null,"-130,230",null,12,7,null,""]
[null,"Fy","Max",null,null,null,null,null,"-130,210",null,11,7,null,""]
[null,null,"Min",null,null,null,null,null,"-130,190",null,10,7,null,""]
[null,"Fz","Max",null,null,null,null,null,"-130,170",null,9,7,null,""]
[null,null,"Min",null,null,null,null,null,"-130,150",null,8,7,null,""]
[null,"Acetabulum right",null,null,null,null,null,null,"-130,130",null,7,7,null,""]
[null,"Fx","Max",null,null,null,null,null,"-130,110",null,6,7,null,""]
[null,null,"Min",null,null,null,null,null,"-130,90",null,5,7,null,""]
[null,"Fy","Max",null,null,null,null,null,"-130,70",null,4,7,null,""]
[null,null,"Min",null,null,null,null,null,"-130,50",null,{"$f":"1+(RIGHT(I341,LEN(I341)-FIND(\",\",I341))-10)/20","v":3},{"$f":"1+((LEFT(I341,FIND(\",\",I341)-1)*-1)-10)/20","v":7},null,{"$f":"IF(AND(K341<=$I$144,K341>=$I$145,L341>=$M$143,L341<=$N$143),MIN(ROUND(M341,2),633),\"\")","v":""}]
[null,"Fz","Max",null,null,null,null,null,"-130,30",null,2,7,null,""]
[null,null,"Min",null,null,null,null,null,"-130,10",null,1,7,null,""]
[null,"Femur (left)",null,null,null,null,null,null,"-150,550",null,28,8,null,""]
[null,"Fz","Max",null,null,null,null,null,"-150,530",null,27,8,null,""]
[null,null,"Min",null,null,null,null,null,"-150,510",null,26,8,null,""]
[null,"Femur (right)",null,null,null,null,null,null,"-150,490",null,25,8,null,""]
[null,"Fz","Max",null,null,null,null,null,"-150,470",null,24,8,null,""]
[null,null,"Min",null,null,null,null,null,"-150,450",null,23,8,null,""]
[null,"Knee (left)",null,null,null,null,null,null,"-150,430",null,22,8,null,""]
[null,"Dknee","Max",null,null,null,null,null,"-150,410",null,21,8,null,""]
[null,null,"Min",null,null,null,null,null,"-150,390",null,20,8,null,""]
[null,"Knee (right)",null,null,null,null,null,null,"-150,370",null,19,8,null,""]
[null,"Dknee","Max",null,null,null,null,null,"-150,350",null,18,8,null,""]
[null,null,"Min",null,null,null,null,null,"-150,330",null,17,8,null,""]
[null,"Upper Tibia (left)",null,null,null,null,null,null,"-150,310",null,16,8,null,""]
[null,"Fx","Max",null,null,null,null,null,"-150,290",null,15,8,null,""]
[null,null,"Min",null,null,null,null,null,"-150,270",null,14,8,null,""]
[null,"Fz","Max",null,null,null,null,null,"-150,250",null,13,8,null,""]
[null,null,"Min",null,null,null,null,null,"-150,230",null,12,8,null,""]
[null,"Mx","Max",null,null,null,null,null,"-150,210",null,11,8,null,""]
[null,null,"Min",null,null,null,null,null,"-150,190",null,10,8,null,""]
[null,"My","Max",null,null,null,null,null,"-150,170",null,9,8,null,""]
[null,null,"Min",null,null,null,null,null,"-150,150",null,8,8,null,""]
[null,"Upper Tibia (right)",null,null,null,null,null,null,"-150,130",null,7,8,null,""]
[null,"Fx","Max",null,null,null,null,null,"-150,110",null,6,8,null,""]
[null,null,"Min",null,null,null,null,null,"-150,90",null,5,8,null,""]
[null,"Fz","Max",null,null,null,null,null,"-150,70",null,4,8,null,""]
[null,null,"Min",null,null,null,null,null,"-150,50",null,3,8,null,""]
[null,"Mx","Max",null,null,null,null,null,"-150,30",null,2,8,null,""]
[null,null,"Min",null,null,null,null,null,"-150,10",null,1,8,null,""]
[null,"My","Max",null,null,null,null,null,"-170,550",null,28,9,null,""]
[null,null,"Min",null,null,null,null,null,"-170,530",null,27,9,null,""]
[null,"Lower Tibia (left)",null,null,null,null,null,null,"-170,510",null,26,9,null,""]
[null,"Fx","Max",null,null,null,null,null,"-170,490",null,25,9,null,""]
[null,null,"Min",null,null,null,null,null,"-170,470",null,24,9,null,""]
[null,"Fy","Max",null,null,null,null,null,"-170,450",null,23,9,null,""]
[null,null,"Min",null,null,null,null,null,"-170,430",null,22,9,null,""]
[null,"Fz","Max",null,null,null,null,null,"-170,410",null,21,9,null,""]
[null,null,"Min",null,null,null,null,null,"-170,390",null,20,9,null,""]
[null,"Mx","Max",null,null,null,null,null,"-170,370",null,19,9,null,""]
[null,null,"Min",null,null,null,null,null,"-170,350",null,18,9,null,""]
[null,"My","Max",null,null,null,null,null,"-170,330",null,17,9,null,""]
[null,null,"Min",null,null,null,null,null,"-170,310",null,16,9,null,""]
[null,"Lower Tibia (right)",null,null,null,null,null,null,"-170,290",null,15,9,null,""]
[null,"Fx","Max",null,null,null,null,null,"-170,270",null,14,9,null,""]
[null,null,"Min",null,null,null,null,null,"-170,250",null,13,9,null,""]
[null,"Fy","Max",null,null,null,null,null,"-170,230",null,12,9,null,""]
[null,null,"Min",null,null,null,null,null,"-170,210",null,11,9,null,""]
[null,"Fz","Max",null,null,null,null,null,"-170,190",null,10,9,null,""]
[null,null,"Min",null,null,null,null,null,"-170,170",null,9,9,null,""]
[null,"Mx","Max",null,null,null,null,null,"-170,150",null,8,9,null,""]
[null,null,"Min",null,null,null,null,null,"-170,130",null,7,9,null,""]
[null,"My","Max",null,null,null,null,null,"-170,110",null,6,9,null,""]
[null,null,"Min",null,null,null,null,null,"-170,90",null,5,9,null,""]
[null,null,null,null,null,null,null,null,"-170,70",null,4,9,null,""]
[null,"TEST DETAILS",null,null,null,null,null,null,"-170,50",null,3,9,null,""]
[null,"Vehicle",null,null,null,null,null,null,"-170,30",null,2,9,null,""]
[null,null,"VIN number",null,null,null,null,null,"-170,10",null,1,9,null,""]
[null,null,"Test weight - kg",null,null,null,null,null,"-190,550",null,28,10,null,""]
[null,"Test",null,null,null,null,null,null,"-190,530",null,27,10,null,""]
[null,null,"Impact speed - km/h",null,null,null,null,null,"-190,510",null,26,10,null,""]
[null,null,"Impact location - mm",null,null,null,null,null,"-190,490",null,25,10,null,""]
[null,null,"Vertical",null,null,null,null,null,"-190,470",null,24,10,null,""]
[null,null,"Horizontal",null,null,null,null,null,"-190,450",null,{"$f":"1+(RIGHT(I405,LEN(I405)-FIND(\",\",I405))-10)/20","v":23},{"$f":"1+((LEFT(I405,FIND(\",\",I405)-1)*-1)-10)/20","v":10},null,{"$f":"IF(AND(K405<=$I$144,K405>=$I$145,L405>=$M$143,L405<=$N$143),MIN(ROUND(M405,2),633),\"\")","v":""}]
[null,null,null,null,null,null,null,null,"-190,430",null,22,10,null,""]
[null,null,null,null,null,null,null,null,"-190,410",null,21,10,null,""]
[null,null,null,null,null,null,null,null,"-190,390",null,20,10,null,""]
[null,null,null,null,null,null,null,null,"-190,370",null,19,10,null,""]
[null,null,null,null,null,null,null,null,"-190,350",null,18,10,null,""]
[null,null,null,null,null,null,null,null,"-190,330",null,17,10,null,""]
[null,null,null,null,null,null,null,null,"-190,310",null,16,10,null,""]
[null,null,null,null,null,null,null,null,"-190,290",null,15,10,null,""]
[null,null,null,null,null,null,null,null,"-190,270",null,14,10,null,""]
[null,null,null,null,null,null,null,null,"-190,250",null,13,10,null,""]
[null,null,null,null,null,null,null,null,"-190,230",null,12,10,null,""]
[null,null,null,null,null,null,null,null,"-190,210",null,11,10,null,""]
[null,null,null,null,null,null,null,null,"-190,190",null,10,10,null,""]
[null,null,null,null,null,null,null,null,"-190,170",null,9,10,null,""]
[null,null,null,null,null,null,null,null,"-190,150",null,8,10,null,""]
[null,null,null,null,null,null,null,null,"-190,130",null,7,10,null,""]
[null,null,null,null,null,null,null,null,"-190,110",null,6,10,null,""]
[null,null,null,null,null,null,null,null,"-190,90",null,5,10,null,""]
[null,null,null,null,null,null,null,null,"-190,70",null,4,10,null,""]
[null,null,null,null,null,null,null,null,"-190,50",null,3,10,null,""]
[null,null,null,null,null,null,null,null,"-190,30",null,2,10,null,""]
[null,null,null,null,null,null,null,null,"-190,10",null,1,10,null,""]
[null,null,null,null,null,null,null,null,"-210,550",null,28,11,null,""]
[null,null,null,null,null,null,null,null,"-210,530",null,27,11,null,""]
[null,null,null,null,null,null,null,null,"-210,510",null,26,11,null,""]
[null,null,null,null,null,null,null,null,"-210,490",null,25,11,null,""]
[null,null,null,null,null,null,null,null,"-210,470",null,24,11,null,""]
[null,null,null,null,null,null,null,null,"-210,450",null,23,11,null,""]
[null,null,null,null,null,null,null,null,"-210,430",null,22,11,null,""]
[null,null,null,null,null,null,null,null,"-210,410",null,21,11,null,""]
[null,null,null,null,null,null,null,null,"-210,390",null,20,11,null,""]
[null,null,null,null,null,null,null,null,"-210,370",null,19,11,null,""]
[null,null,null,null,null,null,null,null,"-210,350",null,18,11,null,""]
[null,null,null,null,null,null,null,null,"-210,330",null,17,11,null,""]
[null,null,null,null,null,null,null,null,"-210,310",null,16,11,null,""]
[null,null,null,null,null,null,null,null,"-210,290",null,15,11,null,""]
[null,null,null,null,null,null,null,null,"-210,270",null,14,11,null,""]
[null,null,null,null,null,null,null,null,"-210,250",null,13,11,null,""]
[null,null,null,null,null,null,null,null,"-210,230",null,12,11,null,""]
[null,null,null,null,null,null,null,null,"-210,210",null,11,11,null,""]
[null,null,null,null,null,null,null,null,"-210,190",null,10,11,null,""]
[null,null,null,null,null,null,null,null,"-210,170",null,9,11,null,""]
[null,null,null,null,null,null,null,null,"-210,150",null,8,11,null,""]
[null,null,null,null,null,null,null,null,"-210,130",null,7,11,null,""]
[null,null,null,null,null,null,null,null,"-210,110",null,6,11,null,""]
[null,null,null,null,null,null,null,null,"-210,90",null,5,11,null,""]
[null,null,null,null,null,null,null,null,"-210,70",null,4,11,null,""]
[null,null,null,null,null,null,null,null,"-210,50",null,3,11,null,""]
[null,null,null,null,null,null,null,null,"-210,30",null,2,11,null,""]
[null,null,null,null,null,null,null,null,"-210,10",null,1,11,null,""]
[null,null,null,null,null,null,null,null,"-230,550",null,28,12,null,""]
[null,null,null,null,null,null,null,null,"-230,530",null,27,12,null,""]
[null,null,null,null,null,null,null,null,"-230,510",null,26,12,null,""]
[null,null,null,null,null,null,null,null,"-230,490",null,25,12,null,""]
[null,null,null,null,null,null,null,null,"-230,470",null,24,12,null,""]
[null,null,null,null,null,null,null,null,"-230,450",null,23,12,null,""]
[null,null,null,null,null,null,null,null,"-230,430",null,22,12,null,""]
[null,null,null,null,null,null,null,null,"-230,410",null,21,12,null,""]
[null,null,null,null,null,null,null,null,"-230,390",null,20,12,null,""]
[null,null,null,null,null,null,null,null,"-230,370",null,19,12,null,""]
[null,null,null,null,null,null,null,null,"-230,350",null,18,12,null,""]
[null,null,null,null,null,null,null,null,"-230,330",null,17,12,null,""]
[null,null,null,null,null,null,null,null,"-230,310",null,16,12,null,""]
[null,null,null,null,null,null,null,null,"-230,290",null,{"$f":"1+(RIGHT(I469,LEN(I469)-FIND(\",\",I469))-10)/20","v":15},{"$f":"1+((LEFT(I469,FIND(\",\",I469)-1)*-1)-10)/20","v":12},null,{"$f":"IF(AND(K469<=$I$144,K469>=$I$145,L469>=$M$143,L469<=$N$143),MIN(ROUND(M469,2),633),\"\")","v":""}]
[null,null,null,null,null,null,null,null,"-230,270",null,14,12,null,""]
[null,null,null,null,null,null,null,null,"-230,250",null,13,12,null,""]
[null,null,null,null,null,null,null,null,"-230,230",null,12,12,null,""]
[null,null,null,null,null,null,null,null,"-230,210",null,11,12,null,""]
[null,null,null,null,null,null,null,null,"-230,190",null,10,12,null,""]
[null,null,null,null,null,null,null,null,"-230,170",null,9,12,null,""]
[null,null,null,null,null,null,null,null,"-230,150",null,8,12,null,""]
[null,null,null,null,null,null,null,null,"-230,130",null,7,12,null,""]
[null,null,null,null,null,null,null,null,"-230,110",null,6,12,null,""]
[null,null,null,null,null,null,null,null,"-230,90",null,5,12,null,""]
[null,null,null,null,null,null,null,null,"-230,70",null,4,12,null,""]
[null,null,null,null,null,null,null,null,"-230,50",null,3,12,null,""]
[null,null,null,null,null,null,null,null,"-230,30",null,2,12,null,""]
[null,null,null,null,null,null,null,null,"-230,10",null,1,12,null,""]
[null,null,null,null,null,null,null,null,"-250,550",null,28,13,null,""]
[null,null,null,null,null,null,null,null,"-250,530",null,27,13,null,""]
[null,null,null,null,null,null,null,null,"-250,510",null,26,13,null,""]
[null,null,null,null,null,null,null,null,"-250,490",null,25,13,null,""]
[null,null,null,null,null,null,null,null,"-250,470",null,24,13,null,""]
[null,null,null,null,null,null,null,null,"-250,450",null,23,13,null,""]
[null,null,null,null,null,null,null,null,"-250,430",null,22,13,null,""]
[null,null,null,null,null,null,null,null,"-250,410",null,21,13,null,""]
[null,null,null,null,null,null,null,null,"-250,390",null,20,13,null,""]
[null,null,null,null,null,null,null,null,"-250,370",null,19,13,null,""]
[null,null,null,null,null,null,null,null,"-250,350",null,18,13,null,""]
[null,null,null,null,null,null,null,null,"-250,330",null,17,13,null,""]
[null,null,null,null,null,null,null,null,"-250,310",null,16,13,null,""]
[null,null,null,null,null,null,null,null,"-250,290",null,15,13,null,""]
[null,null,null,null,null,null,null,null,"-250,270",null,14,13,null,""]
[null,null,null,null,null,null,null,null,"-250,250",null,13,13,null,""]
[null,null,null,null,null,null,null,null,"-250,230",null,12,13,null,""]
[null,null,null,null,null,null,null,null,"-250,210",null,11,13,null,""]
[null,null,null,null,null,null,null,null,"-250,190",null,10,13,null,""]
[null,null,null,null,null,null,null,null,"-250,170",null,9,13,null,""]
[null,null,null,null,null,null,null,null,"-250,150",null,8,13,null,""]
[null,null,null,null,null,null,null,null,"-250,130",null,7,13,null,""]
[null,null,null,null,null,null,null,null,"-250,110",null,6,13,null,""]
[null,null,null,null,null,null,null,null,"-250,90",null,5,13,null,""]
[null,null,null,null,null,null,null,null,"-250,70",null,4,13,null,""]
[null,null,null,null,null,null,null,null,"-250,50",null,3,13,null,""]
[null,null,null,null,null,null,null,null,"-250,30",null,2,13,null,""]
[null,null,null,null,null,null,null,null,"-250,10",null,1,13,null,""]
[null,null,null,null,null,null,null,null,"-270,550",null,28,14,null,""]
[null,null,null,null,null,null,null,null,"-270,530",null,27,14,null,""]
[null,null,null,null,null,null,null,null,"-270,510",null,26,14,null,""]
[null,null,null,null,null,null,null,null,"-270,490",null,25,14,null,""]
[null,null,null,null,null,null,null,null,"-270,470",null,24,14,null,""]
[null,null,null,null,null,null,null,null,"-270,450",null,23,14,null,""]
[null,null,null,null,null,null,null,null,"-270,430",null,22,14,null,""]
[null,null,null,null,null,null,null,null,"-270,410",null,21,14,null,""]
[null,null,null,null,null,null,null,null,"-270,390",null,20,14,null,""]
[null,null,null,null,null,null,null,null,"-270,370",null,19,14,null,""]
[null,null,null,null,null,null,null,null,"-270,350",null,18,14,null,""]
[null,null,null,null,null,null,null,null,"-270,330",null,17,14,null,""]
[null,null,null,null,null,null,null,null,"-270,310",null,16,14,null,""]
[null,null,null,null,null,null,null,null,"-270,290",null,15,14,null,""]
[null,null,null,null,null,null,null,null,"-270,270",null,14,14,null,""]
[null,null,null,null,null,null,null,null,"-270,250",null,13,14,null,""]
[null,null,null,null,null,null,null,null,"-270,230",null,12,14,null,""]
[null,null,null,null,null,null,null,null,"-270,210",null,11,14,null,""]
[null,null,null,null,null,null,null,null,"-270,190",null,10,14,null,""]
[null,null,null,null,null,null,null,null,"-270,170",null,9,14,null,""]
[null,null,null,null,null,null,null,null,"-270,150",null,8,14,null,""]
[null,null,null,null,null,null,null,null,"-270,130",null,{"$f":"1+(RIGHT(I533,LEN(I533)-FIND(\",\",I533))-10)/20","v":7},{"$f":"1+((LEFT(I533,FIND(\",\",I533)-1)*-1)-10)/20","v":14},null,{"$f":"IF(AND(K533<=$I$144,K533>=$I$145,L533>=$M$143,L533<=$N$143),MIN(ROUND(M533,2),633),\"\")","v":""}]
[null,null,null,null,null,null,null,null,"-270,110",null,6,14,null,""]
[null,null,null,null,null,null,null,null,"-270,90",null,5,14,null,""]
[null,null,null,null,null,null,null,null,"-270,70",null,4,14,null,""]
[null,null,null,null,null,null,null,null,"-270,50",null,3,14,null,""]
[null,null,null,null,null,null,null,null,"-270,30",null,2,14,null,""]
[null,null,null,null,null,null,null,null,"-270,10",null,1,14,null,""]
[null,null,null,null,null,null,null,null,"-290,550",null,28,15,null,""]
[null,null,null,null,null,null,null,null,"-290,530",null,27,15,null,""]
[null,null,null,null,null,null,null,null,"-290,510",null,26,15,null,""]
[null,null,null,null,null,null,null,null,"-290,490",null,25,15,null,""]
[null,null,null,null,null,null,null,null,"-290,470",null,24,15,null,""]
[null,null,null,null,null,null,null,null,"-290,450",null,23,15,null,""]
[null,null,null,null,null,null,null,null,"-290,430",null,22,15,null,""]
[null,null,null,null,null,null,null,null,"-290,410",null,21,15,null,""]
[null,null,null,null,null,null,null,null,"-290,390",null,20,15,null,""]
[null,null,null,null,null,null,null,null,"-290,370",null,19,15,null,""]
[null,null,null,null,null,null,null,null,"-290,350",null,18,15,null,""]
[null,null,null,null,null,null,null,null,"-290,330",null,17,15,null,""]
[null,null,null,null,null,null,null,null,"-290,310",null,16,15,null,""]
[null,null,null,null,null,null,null,null,"-290,290",null,15,15,null,""]
[null,null,null,null,null,null,null,null,"-290,270",null,14,15,null,""]
[null,null,null,null,null,null,null,null,"-290,250",null,13,15,null,""]
[null,null,null,null,null,null,null,null,"-290,230",null,12,15,null,""]
[null,null,null,null,null,null,null,null,"-290,210",null,11,15,null,""]
[null,null,null,null,null,null,null,null,"-290,190",null,10,15,null,""]
[null,null,null,null,null,null,null,null,"-290,170",null,9,15,null,""]
[null,null,null,null,null,null,null,null,"-290,150",null,8,15,null,""]
[null,null,null,null,null,null,null,null,"-290,130",null,7,15,null,""]
[null,null,null,null,null,null,null,null,"-290,110",null,6,15,null,""]
[null,null,null,null,null,null,null,null,"-290,90",null,5,15,null,""]
[null,null,null,null,null,null,null,null,"-290,70",null,4,15,null,""]
[null,null,null,null,null,null,null,null,"-290,50",null,3,15,null,""]
[null,null,null,null,null,null,null,null,"-290,30",null,2,15,null,""]
[null,null,null,null,null,null,null,null,"-290,10",null,1,15,null,""]
[null,null,null,null,null,null,null,null,"-310,550",null,28,16,null,""]
[null,null,null,null,null,null,null,null,"-310,530",null,27,16,null,""]
[null,null,null,null,null,null,null,null,"-310,510",null,26,16,null,""]
[null,null,null,null,null,null,null,null,"-310,490",null,25,16,null,""]
[null,null,null,null,null,null,null,null,"-310,470",null,24,16,null,""]
[null,null,null,null,null,null,null,null,"-310,450",null,23,16,null,""]
[null,null,null,null,null,null,null,null,"-310,430",null,22,16,null,""]
[null,null,null,null,null,null,null,null,"-310,410",null,21,16,null,""]
[null,null,null,null,null,null,null,null,"-310,390",null,20,16,null,""]
[null,null,null,null,null,null,null,null,"-310,370",null,19,16,null,""]
[null,null,null,null,null,null,null,null,"-310,350",null,18,16,null,""]
[null,null,null,null,null,null,null,null,"-310,330",null,17,16,null,""]
[null,null,null,null,null,null,null,null,"-310,310",null,16,16,null,""]
[null,null,null,null,null,null,null,null,"-310,290",null,15,16,null,""]
[null,null,null,null,null,null,null,null,"-310,270",null,14,16,null,""]
[null,null,null,null,null,null,null,null,"-310,250",null,13,16,null,""]
[null,null,null,null,null,null,null,null,"-310,230",null,12,16,null,""]
[null,null,null,null,null,null,null,null,"-310,210",null,11,16,null,""]
[null,null,null,null,null,null,null,null,"-310,190",null,10,16,null,""]
[null,null,null,null,null,null,null,null,"-310,170",null,9,16,null,""]
[null,null,null,null,null,null,null,null,"-310,150",null,8,16,null,""]
[null,null,null,null,null,null,null,null,"-310,130",null,7,16,null,""]
[null,null,null,null,null,null,null,null,"-310,110",null,6,16,null,""]
[null,null,null,null,null,null,null,null,"-310,90",null,5,16,null,""]
[null,null,null,null,null,null,null,null,"-310,70",null,4,16,null,""]
[null,null,null,null,null,null,null,null,"-310,50",null,3,16,null,""]
[null,null,null,null,null,null,null,null,"-310,30",null,2,16,null,""]
[null,null,null,null,null,null,null,null,"-310,10",null,1,16,null,""]
[null,null,null,null,null,null,null,null,"-330,550",null,28,17,null,""]
[null,null,null,null,null,null,null,null,"-330,530",null,{"$f":"1+(RIGHT(I597,LEN(I597)-FIND(\",\",I597))-10)/20","v":27},{"$f":"1+((LEFT(I597,FIND(\",\",I597)-1)*-1)-10)/20","v":17},null,{"$f":"IF(AND(K597<=$I$144,K597>=$I$145,L597>=$M$143,L597<=$N$143),MIN(ROUND(M597,2),633),\"\")","v":""}]
[null,null,null,null,null,null,null,null,"-330,510",null,26,17,null,""]
[null,null,null,null,null,null,null,null,"-330,490",null,25,17,null,""]
[null,null,null,null,null,null,null,null,"-330,470",null,24,17,null,""]
[null,null,null,null,null,null,null,null,"-330,450",null,23,17,null,""]
[null,null,null,null,null,null,null,null,"-330,430",null,22,17,null,""]
[null,null,null,null,null,null,null,null,"-330,410",null,21,17,null,""]
[null,null,null,null,null,null,null,null,"-330,390",null,20,17,null,""]
[null,null,null,null,null,null,null,null,"-330,370",null,19,17,null,""]
[null,null,null,null,null,null,null,null,"-330,350",null,18,17,null,""]
[null,null,null,null,null,null,null,null,"-330,330",null,17,17,null,""]
[null,null,null,null,null,null,null,null,"-330,310",null,16,17,null,""]
[null,null,null,null,null,null,null,null,"-330,290",null,15,17,null,""]
[null,null,null,null,null,null,null,null,"-330,270",null,14,17,null,""]
[null,null,null,null,null,null,null,null,"-330,250",null,13,17,null,""]
[null,null,null,null,null,null,null,null,"-330,230",null,12,17,null,""]
[null,null,null,null,null,null,null,null,"-330,210",null,11,17,null,""]
[null,null,null,null,null,null,null,null,"-330,190",null,10,17,null,""]
[null,null,null,null,null,null,null,null,"-330,170",null,9,17,null,""]
[null,null,null,null,null,null,null,null,"-330,150",null,8,17,null,""]
[null,null,null,null,null,null,null,null,"-330,130",null,7,17,null,""]
[null,null,null,null,null,null,null,null,"-330,110",null,6,17,null,""]
[null,null,null,null,null,null,null,null,"-330,90",null,5,17,null,""]
[null,null,null,null,null,null,null,null,"-330,70",null,4,17,null,""]
[null,null,null,null,null,null,null,null,"-330,50",null,3,17,null,""]
[null,null,null,null,null,null,null,null,"-330,30",null,2,17,null,""]
[null,null,null,null,null,null,null,null,"-330,10",null,1,17,null,""]
[null,null,null,null,null,null,null,null,"-350,550",null,28,18,null,""]
[null,null,null,null,null,null,null,null,"-350,530",null,27,18,null,""]
[null,null,null,null,null,null,null,null,"-350,510",null,26,18,null,""]
[null,null,null,null,null,null,null,null,"-350,490",null,25,18,null,""]
[null,null,null,null,null,null,null,null,"-350,470",null,24,18,null,""]
[null,null,null,null,null,null,null,null,"-350,450",null,23,18,null,""]
[null,null,null,null,null,null,null,null,"-350,430",null,22,18,null,""]
[null,null,null,null,null,null,null,null,"-350,410",null,21,18,null,""]
[null,null,null,null,null,null,null,null,"-350,390",null,20,18,null,""]
[null,null,null,null,null,null,null,null,"-350,370",null,19,18,null,""]
[null,null,null,null,null,null,null,null,"-350,350",null,18,18,null,""]
[null,null,null,null,null,null,null,null,"-350,330",null,17,18,null,""]
[null,null,null,null,null,null,null,null,"-350,310",null,16,18,null,""]
[null,null,null,null,null,null,null,null,"-350,290",null,15,18,null,""]
[null,null,null,null,null,null,null,null,"-350,270",null,14,18,null,""]
[null,null,null,null,null,null,null,null,"-350,250",null,13,18,null,""]
[null,null,null,null,null,null,null,null,"-350,230",null,12,18,null,""]
[null,null,null,null,null,null,null,null,"-350,210",null,11,18,null,""]
[null,null,null,null,null,null,null,null,"-350,190",null,10,18,null,""]
[null,null,null,null,null,null,null,null,"-350,170",null,9,18,null,""]
[null,null,null,null,null,null,null,null,"-350,150",null,8,18,null,""]
[null,null,null,null,null,null,null,null,"-350,130",null,7,18,null,""]
[null,null,null,null,null,null,null,null,"-350,110",null,6,18,null,""]
[null,null,null,null,null,null,null,null,"-350,90",null,5,18,null,""]
[null,null,null,null,null,null,null,null,"-350,70",null,4,18,null,""]
[null,null,null,null,null,null,null,null,"-350,50",null,3,18,null,""]
[null,null,null,null,null,null,null,null,"-350,30",null,2,18,null,""]
[null,null,null,null,null,null,null,null,"-350,10",null,1,18,null,""]
[null,null,null,null,null,null,null,null,"-370,550",null,28,19,null,""]
[null,null,null,null,null,null,null,null,"-370,530",null,27,19,null,""]
[null,null,null,null,null,null,null,null,"-370,510",null,26,19,null,""]
[null,null,null,null,null,null,null,null,"-370,490",null,25,19,null,""]
[null,null,null,null,null,null,null,null,"-370,470",null,24,19,null,""]
[null,null,null,null,null,null,null,null,"-370,450",null,23,19,null,""]
[null,null,null,null,null,null,null,null,"-370,430",null,22,19,null,""]
[null,null,null,null,null,null,null,null,"-370,410",null,21,19,null,""]
[null,null,null,null,null,null,null,null,"-370,390",null,20,19,null,""]
[null,null,null,null,null,null,null,null,"-370,370",null,{"$f":"1+(RIGHT(I661,LEN(I661)-FIND(\",\",I661))-10)/20","v":19},{"$f":"1+((LEFT(I661,FIND(\",\",I661)-1)*-1)-10)/20","v":19},null,{"$f":"IF(AND(K661<=$I$144,K661>=$I$145,L661>=$M$143,L661<=$N$143),MIN(ROUND(M661,2),633),\"\")","v":""}]
[null,null,null,null,null,null,null,null,"-370,350",null,18,19,null,""]
[null,null,null,null,null,null,null,null,"-370,330",null,17,19,null,""]
[null,null,null,null,null,null,null,null,"-370,310",null,16,19,null,""]
[null,null,null,null,null,null,null,null,"-370,290",null,15,19,null,""]
[null,null,null,null,null,null,null,null,"-370,270",null,14,19,null,""]
[null,null,null,null,null,null,null,null,"-370,250",null,13,19,null,""]
[null,null,null,null,null,null,null,null,"-370,230",null,12,19,null,""]
[null,null,null,null,null,null,null,null,"-370,210",null,11,19,null,""]
[null,null,null,null,null,null,null,null,"-370,190",null,10,19,null,""]
[null,null,null,null,null,null,null,null,"-370,170",null,9,19,null,""]
[null,null,null,null,null,null,null,null,"-370,150",null,8,19,null,""]
[null,null,null,null,null,null,null,null,"-370,130",null,7,19,null,""]
[null,null,null,null,null,null,null,null,"-370,110",null,6,19,null,""]
[null,null,null,null,null,null,null,null,"-370,90",null,5,19,null,""]
[null,null,null,null,null,null,null,null,"-370,70",null,4,19,null,""]
[null,null,null,null,null,null,null,null,"-370,50",null,3,19,null,""]
[null,null,null,null,null,null,null,null,"-370,30",null,2,19,null,""]
[null,null,null,null,null,null,null,null,"-370,10",null,1,19,null,""]
[null,null,null,null,null,null,null,null,"-390,550",null,28,20,null,""]
[null,null,null,null,null,null,null,null,"-390,530",null,27,20,null,""]
[null,null,null,null,null,null,null,null,"-390,510",null,26,20,null,""]
[null,null,null,null,null,null,null,null,"-390,490",null,25,20,null,""]
[null,null,null,null,null,null,null,null,"-390,470",null,24,20,null,""]
[null,null,null,null,null,null,null,null,"-390,450",null,23,20,null,""]
[null,null,null,null,null,null,null,null,"-390,430",null,22,20,null,""]
[null,null,null,null,null,null,null,null,"-390,410",null,21,20,null,""]
[null,null,null,null,null,null,null,null,"-390,390",null,20,20,null,""]
[null,null,null,null,null,null,null,null,"-390,370",null,19,20,null,""]
[null,null,null,null,null,null,null,null,"-390,350",null,18,20,null,""]
[null,null,null,null,null,null,null,null,"-390,330",null,17,20,null,""]
[null,null,null,null,null,null,null,null,"-390,310",null,16,20,null,""]
[null,null,null,null,null,null,null,null,"-390,290",null,15,20,null,""]
[null,null,null,null,null,null,null,null,"-390,270",null,14,20,null,""]
[null,null,null,null,null,null,null,null,"-390,250",null,13,20,null,""]
[null,null,null,null,null,null,null,null,"-390,230",null,12,20,null,""]
[null,null,null,null,null,null,null,null,"-390,210",null,11,20,null,""]
[null,null,null,null,null,null,null,null,"-390,190",null,10,20,null,""]
[null,null,null,null,null,null,null,null,"-390,170",null,9,20,null,""]
[null,null,null,null,null,null,null,null,"-390,150",null,8,20,null,""]
[null,null,null,null,null,null,null,null,"-390,130",null,7,20,null,""]
[null,null,null,null,null,null,null,null,"-390,110",null,6,20,null,""]
[null,null,null,null,null,null,null,null,"-390,90",null,5,20,null,""]
[null,null,null,null,null,null,null,null,"-390,70",null,4,20,null,""]
[null,null,null,null,null,null,null,null,"-390,50",null,3,20,null,""]
[null,null,null,null,null,null,null,null,"-390,30",null,2,20,null,""]
[null,null,null,null,null,null,null,null,"-390,10",null,1,20,null,""]
[null,null,null,null,null,null,null,null,"-410,550",null,28,21,null,""]
[null,null,null,null,null,null,null,null,"-410,530",null,27,21,null,""]
[null,null,null,null,null,null,null,null,"-410,510",null,26,21,null,""]
[null,null,null,null,null,null,null,null,"-410,490",null,25,21,null,""]
[null,null,null,null,null,null,null,null,"-410,470",null,24,21,null,""]
[null,null,null,null,null,null,null,null,"-410,450",null,23,21,null,""]
[null,null,null,null,null,null,null,null,"-410,430",null,22,21,null,""]
[null,null,null,null,null,null,null,null,"-410,410",null,21,21,null,""]
[null,null,null,null,null,null,null,null,"-410,390",null,20,21,null,""]
[null,null,null,null,null,null,null,null,"-410,370",null,19,21,null,""]
[null,null,null,null,null,null,null,null,"-410,350",null,18,21,null,""]
[null,null,null,null,null,null,null,null,"-410,330",null,17,21,null,""]
[null,null,null,null,null,null,null,null,"-410,310",null,16,21,null,""]
[null,null,null,null,null,null,null,null,"-410,290",null,15,21,null,""]
[null,null,null,null,null,null,null,null,"-410,270",null,14,21,null,""]
[null,null,null,null,null,null,null,null,"-410,250",null,13,21,null,""]
[null,null,null,null,null,null,null,null,"-410,230",null,12,21,null,""]
[null,null,null,null,null,null,null,null,"-410,210",null,{"$f":"1+(RIGHT(I725,LEN(I725)-FIND(\",\",I725))-10)/20","v":11},{"$f":"1+((LEFT(I725,FIND(\",\",I725)-1)*-1)-10)/20","v":21},null,{"$f":"IF(AND(K725<=$I$144,K725>=$I$145,L725>=$M$143,L725<=$N$143),MIN(ROUND(M725,2),633),\"\")","v":""}]
[null,null,null,null,null,null,null,null,"-410,190",null,10,21,null,""]
[null,null,null,null,null,null,null,null,"-410,170",null,9,21,null,""]
[null,null,null,null,null,null,null,null,"-410,150",null,8,21,null,""]
[null,null,null,null,null,null,null,null,"-410,130",null,7,21,null,""]
[null,null,null,null,null,null,null,null,"-410,110",null,6,21,null,""]
[null,null,null,null,null,null,null,null,"-410,90",null,5,21,null,""]
[null,null,null,null,null,null,null,null,"-410,70",null,4,21,null,""]
[null,null,null,null,null,null,null,null,"-410,50",null,3,21,null,""]
[null,null,null,null,null,null,null,null,"-410,30",null,2,21,null,""]
[null,null,null,null,null,null,null,null,"-410,10",null,1,21,null,""]
[null,null,null,null,null,null,null,null,"-430,550",null,28,22,null,""]
[null,null,null,null,null,null,null,null,"-430,530",null,27,22,null,""]
[null,null,null,null,null,null,null,null,"-430,510",null,26,22,null,""]
[null,null,null,null,null,null,null,null,"-430,490",null,25,22,null,""]
[null,null,null,null,null,null,null,null,"-430,470",null,24,22,null,""]
[null,null,null,null,null,null,null,null,"-430,450",null,23,22,null,""]
[null,null,null,null,null,null,null,null,"-430,430",null,22,22,null,""]
[null,null,null,null,null,null,null,null,"-430,410",null,21,22,null,""]
[null,null,null,null,null,null,null,null,"-430,390",null,20,22,null,""]
[null,null,null,null,null,null,null,null,"-430,370",null,19,22,null,""]
[null,null,null,null,null,null,null,null,"-430,350",null,18,22,null,""]
[null,null,null,null,null,null,null,null,"-430,330",null,17,22,null,""]
[null,null,null,null,null,null,null,null,"-430,310",null,16,22,null,""]
[null,null,null,null,null,null,null,null,"-430,290",null,15,22,null,""]
[null,null,null,null,null,null,null,null,"-430,270",null,14,22,null,""]
[null,null,null,null,null,null,null,null,"-430,250",null,13,22,null,""]
[null,null,null,null,null,null,null,null,"-430,230",null,12,22,null,""]
[null,null,null,null,null,null,null,null,"-430,210",null,11,22,null,""]
[null,null,null,null,null,null,null,null,"-430,190",null,10,22,null,""]
[null,null,null,null,null,null,null,null,"-430,170",null,9,22,null,""]
[null,null,null,null,null,null,null,null,"-430,150",null,8,22,null,""]
[null,null,null,null,null,null,null,null,"-430,130",null,7,22,null,""]
[null,null,null,null,null,null,null,null,"-430,110",null,6,22,null,""]
[null,null,null,null,null,null,null,null,"-430,90",null,5,22,null,""]
[null,null,null,null,null,null,null,null,"-430,70",null,4,22,null,""]
[null,null,null,null,null,null,null,null,"-430,50",null,3,22,null,""]
[null,null,null,null,null,null,null,null,"-430,30",null,2,22,null,""]
[null,null,null,null,null,null,null,null,"-430,10",null,1,22,null,""]
[null,null,null,null,null,null,null,null,"-450,550",null,28,23,null,""]
[null,null,null,null,null,null,null,null,"-450,530",null,27,23,null,""]
[null,null,null,null,null,null,null,null,"-450,510",null,26,23,null,""]
[null,null,null,null,null,null,null,null,"-450,490",null,25,23,null,""]
[null,null,null,null,null,null,null,null,"-450,470",null,24,23,null,""]
[null,null,null,null,null,null,null,null,"-450,450",null,23,23,null,""]
[null,null,null,null,null,null,null,null,"-450,430",null,22,23,null,""]
[null,null,null,null,null,null,null,null,"-450,410",null,21,23,null,""]
[null,null,null,null,null,null,null,null,"-450,390",null,20,23,null,""]
[null,null,null,null,null,null,null,null,"-450,370",null,19,23,null,""]
[null,null,null,null,null,null,null,null,"-450,350",null,18,23,null,""]
[null,null,null,null,null,null,null,null,"-450,330",null,17,23,null,""]
[null,null,null,null,null,null,null,null,"-450,310",null,16,23,null,""]
[null,null,null,null,null,null,null,null,"-450,290",null,15,23,null,""]
[null,null,null,null,null,null,null,null,"-450,270",null,14,23,null,""]
[null,null,null,null,null,null,null,null,"-450,250",null,13,23,null,""]
[null,null,null,null,null,null,null,null,"-450,230",null,12,23,null,""]
[null,null,null,null,null,null,null,null,"-450,210",null,11,23,null,""]
[null,null,null,null,null,null,null,null,"-450,190",null,10,23,null,""]
[null,null,null,null,null,null,null,null,"-450,170",null,9,23,null,""]
[null,null,null,null,null,null,null,null,"-450,150",null,8,23,null,""]
[null,null,null,null,null,null,null,null,"-450,130",null,7,23,null,""]
[null,null,null,null,null,null,null,null,"-450,110",null,6,23,null,""]
[null,null,null,null,null,null,null,null,"-450,90",null,5,23,null,""]
[null,null,null,null,null,null,null,null,"-450,70",null,4,23,null,""]
[null,null,null,null,null,null,null,null,"-450,50",null,{"$f":"1+(RIGHT(I789,LEN(I789)-FIND(\",\",I789))-10)/20","v":3},{"$f":"1+((LEFT(I789,FIND(\",\",I789)-1)*-1)-10)/20","v":23},null,{"$f":"IF(AND(K789<=$I$144,K789>=$I$145,L789>=$M$143,L789<=$N$143),MIN(ROUND(M789,2),633),\"\")","v":""}]
[null,null,null,null,null,null,null,null,"-450,30",null,2,23,null,""]
[null,null,null,null,null,null,null,null,"-450,10",null,1,23,null,""]
[null,null,null,null,null,null,null,null,"-470,550",null,28,24,null,""]
[null,null,null,null,null,null,null,null,"-470,530",null,27,24,null,""]
[null,null,null,null,null,null,null,null,"-470,510",null,26,24,null,""]
[null,null,null,null,null,null,null,null,"-470,490",null,25,24,null,""]
[null,null,null,null,null,null,null,null,"-470,470",null,24,24,null,""]
[null,null,null,null,null,null,null,null,"-470,450",null,23,24,null,""]
[null,null,null,null,null,null,null,null,"-470,430",null,22,24,null,""]
[null,null,null,null,null,null,null,null,"-470,410",null,21,24,null,""]
[null,null,null,null,null,null,null,null,"-470,390",null,20,24,null,""]
[null,null,null,null,null,null,null,null,"-470,370",null,19,24,null,""]
[null,null,null,null,null,null,null,null,"-470,350",null,18,24,null,""]
[null,null,null,null,null,null,null,null,"-470,330",null,17,24,null,""]
[null,null,null,null,null,null,null,null,"-470,310",null,16,24,null,""]
[null,null,null,null,null,null,null,null,"-470,290",null,15,24,null,""]
[null,null,null,null,null,null,null,null,"-470,270",null,14,24,null,""]
[null,null,null,null,null,null,null,null,"-470,250",null,13,24,null,""]
[null,null,null,null,null,null,null,null,"-470,230",null,12,24,null,""]
[null,null,null,null,null,null,null,null,"-470,210",null,11,24,null,""]
[null,null,null,null,null,null,null,null,"-470,190",null,10,24,null,""]
[null,null,null,null,null,null,null,null,"-470,170",null,9,24,null,""]
[null,null,null,null,null,null,null,null,"-470,150",null,8,24,null,""]
[null,null,null,null,null,null,null,null,"-470,130",null,7,24,null,""]
[null,null,null,null,null,null,null,null,"-470,110",null,6,24,null,""]
[null,null,null,null,null,null,null,null,"-470,90",null,5,24,null,""]
[null,null,null,null,null,null,null,null,"-470,70",null,4,24,null,""]
[null,null,null,null,null,null,null,null,"-470,50",null,3,24,null,""]
[null,null,null,null,null,null,null,null,"-470,30",null,2,24,null,""]
[null,null,null,null,null,null,null,null,"-470,10",null,1,24,null,""]
[null,null,null,null,null,null,null,null,"-490,550",null,28,25,null,""]
[null,null,null,null,null,null,null,null,"-490,530",null,27,25,null,""]
[null,null,null,null,null,null,null,null,"-490,510",null,26,25,null,""]
[null,null,null,null,null,null,null,null,"-490,490",null,25,25,null,""]
[null,null,null,null,null,null,null,null,"-490,470",null,24,25,null,""]
[null,null,null,null,null,null,null,null,"-490,450",null,23,25,null,""]
[null,null,null,null,null,null,null,null,"-490,430",null,22,25,null,""]
[null,null,null,null,null,null,null,null,"-490,410",null,21,25,null,""]
[null,null,null,null,null,null,null,null,"-490,390",null,20,25,null,""]
[null,null,null,null,null,null,null,null,"-490,370",null,19,25,null,""]
[null,null,null,null,null,null,null,null,"-490,350",null,18,25,null,""]
[null,null,null,null,null,null,null,null,"-490,330",null,17,25,null,""]
[null,null,null,null,null,null,null,null,"-490,310",null,16,25,null,""]
[null,null,null,null,null,null,null,null,"-490,290",null,15,25,null,""]
[null,null,null,null,null,null,null,null,"-490,270",null,14,25,null,""]
[null,null,null,null,null,null,null,null,"-490,250",null,13,25,null,""]
[null,null,null,null,null,null,null,null,"-490,230",null,12,25,null,""]
[null,null,null,null,null,null,null,null,"-490,210",null,11,25,null,""]
[null,null,null,null,null,null,null,null,"-490,190",null,10,25,null,""]
[null,null,null,null,null,null,null,null,"-490,170",null,9,25,null,""]
[null,null,null,null,null,null,null,null,"-490,150",null,8,25,null,""]
[null,null,null,null,null,null,null,null,"-490,130",null,7,25,null,""]
[null,null,null,null,null,null,null,null,"-490,110",null,6,25,null,""]
[null,null,null,null,null,null,null,null,"-490,90",null,5,25,null,""]
[null,null,null,null,null,null,null,null,"-490,70",null,4,25,null,""]
[null,null,null,null,null,null,null,null,"-490,50",null,3,25,null,""]
[null,null,null,null,null,null,null,null,"-490,30",null,2,25,null,""]
[null,null,null,null,null,null,null,null,"-490,10",null,1,25,null,""]
[null,null,null,null,null,null,null,null,"-510,550",null,28,26,null,""]
[null,null,null,null,null,null,null,null,"-510,530",null,27,26,null,""]
[null,null,null,null,null,null,null,null,"-510,510",null,26,26,null,""]
[null,null,null,null,null,null,null,null,"-510,490",null,25,26,null,""]
[null,null,null,null,null,null,null,null,"-510,470",null,24,26,null,""]
[null,null,null,null,null,null,null,null,"-510,450",null,{"$f":"1+(RIGHT(I853,LEN(I853)-FIND(\",\",I853))-10)/20","v":23},{"$f":"1+((LEFT(I853,FIND(\",\",I853)-1)*-1)-10)/20","v":26},null,{"$f":"IF(AND(K853<=$I$144,K853>=$I$145,L853>=$M$143,L853<=$N$143),MIN(ROUND(M853,2),633),\"\")","v":""}]
[null,null,null,null,null,null,null,null,"-510,430",null,22,26,null,""]
[null,null,null,null,null,null,null,null,"-510,410",null,21,26,null,""]
[null,null,null,null,null,null,null,null,"-510,390",null,20,26,null,""]
[null,null,null,null,null,null,null,null,"-510,370",null,19,26,null,""]
[null,null,null,null,null,null,null,null,"-510,350",null,18,26,null,""]
[null,null,null,null,null,null,null,null,"-510,330",null,17,26,null,""]
[null,null,null,null,null,null,null,null,"-510,310",null,16,26,null,""]
[null,null,null,null,null,null,null,null,"-510,290",null,15,26,null,""]
[null,null,null,null,null,null,null,null,"-510,270",null,14,26,null,""]
[null,null,null,null,null,null,null,null,"-510,250",null,13,26,null,""]
[null,null,null,null,null,null,null,null,"-510,230",null,12,26,null,""]
[null,null,null,null,null,null,null,null,"-510,210",null,11,26,null,""]
[null,null,null,null,null,null,null,null,"-510,190",null,10,26,null,""]
[null,null,null,null,null,null,null,null,"-510,170",null,9,26,null,""]
[null,null,null,null,null,null,null,null,"-510,150",null,8,26,null,""]
[null,null,null,null,null,null,null,null,"-510,130",null,7,26,null,""]
[null,null,null,null,null,null,null,null,"-510,110",null,6,26,null,""]
[null,null,null,null,null,null,null,null,"-510,90",null,5,26,null,""]
[null,null,null,null,null,null,null,null,"-510,70",null,4,26,null,""]
[null,null,null,null,null,null,null,null,"-510,50",null,3,26,null,""]
[null,null,null,null,null,null,null,null,"-510,30",null,2,26,null,""]
[null,null,null,null,null,null,null,null,"-510,10",null,1,26,null,""]
[null,null,null,null,null,null,null,null,"-530,550",null,28,27,null,""]
[null,null,null,null,null,null,null,null,"-530,530",null,27,27,null,""]
[null,null,null,null,null,null,null,null,"-530,510",null,26,27,null,""]
[null,null,null,null,null,null,null,null,"-530,490",null,25,27,null,""]
[null,null,null,null,null,null,null,null,"-530,470",null,24,27,null,""]
[null,null,null,null,null,null,null,null,"-530,450",null,23,27,null,""]
[null,null,null,null,null,null,null,null,"-530,430",null,22,27,null,""]
[null,null,null,null,null,null,null,null,"-530,410",null,21,27,null,""]
[null,null,null,null,null,null,null,null,"-530,390",null,20,27,null,""]
[null,null,null,null,null,null,null,null,"-530,370",null,19,27,null,""]
[null,null,null,null,null,null,null,null,"-530,350",null,18,27,null,""]
[null,null,null,null,null,null,null,null,"-530,330",null,17,27,null,""]
[null,null,null,null,null,null,null,null,"-530,310",null,16,27,null,""]
[null,null,null,null,null,null,null,null,"-530,290",null,15,27,null,""]
[null,null,null,null,null,null,null,null,"-530,270",null,14,27,null,""]
[null,null,null,null,null,null,null,null,"-530,250",null,13,27,null,""]
[null,null,null,null,null,null,null,null,"-530,230",null,12,27,null,""]
[null,null,null,null,null,null,null,null,"-530,210",null,11,27,null,""]
[null,null,null,null,null,null,null,null,"-530,190",null,10,27,null,""]
[null,null,null,null,null,null,null,null,"-530,170",null,9,27,null,""]
[null,null,null,null,null,null,null,null,"-530,150",null,8,27,null,""]
[null,null,null,null,null,null,null,null,"-530,130",null,7,27,null,""]
[null,null,null,null,null,null,null,null,"-530,110",null,6,27,null,""]
[null,null,null,null,null,null,null,null,"-530,90",null,5,27,null,""]
[null,null,null,null,null,null,null,null,"-530,70",null,4,27,null,""]
[null,null,null,null,null,null,null,null,"-530,50",null,3,27,null,""]
[null,null,null,null,null,null,null,null,"-530,30",null,2,27,null,""]
[null,null,null,null,null,null,null,null,"-530,10",null,1,27,null,""]
[null,null,null,null,null,null,null,null,"-550,550",null,28,28,null,""]
[null,null,null,null,null,null,null,null,"-550,530",null,27,28,null,""]
[null,null,null,null,null,null,null,null,"-550,510",null,26,28,null,""]
[null,null,null,null,null,null,null,null,"-550,490",null,25,28,null,""]
[null,null,null,null,null,null,null,null,"-550,470",null,24,28,null,""]
[null,null,null,null,null,null,null,null,"-550,450",null,23,28,null,""]
[null,null,null,null,null,null,null,null,"-550,430",null,22,28,null,""]
[null,null,null,null,null,null,null,null,"-550,410",null,21,28,null,""]
[null,null,null,null,null,null,null,null,"-550,390",null,20,28,null,""]
[null,null,null,null,null,null,null,null,"-550,370",null,19,28,null,""]
[null,null,null,null,null,null,null,null,"-550,350",null,18,28,null,""]
[null,null,null,null,null,null,null,null,"-550,330",null,17,28,null,""]
[null,null,null,null,null,null,null,null,"-550,310",null,16,28,null,""]
[null,null,null,null,null,null,null,null,"-550,290",null,{"$f":"1+(RIGHT(I917,LEN(I917)-FIND(\",\",I917))-10)/20","v":15},{"$f":"1+((LEFT(I917,FIND(\",\",I917)-1)*-1)-10)/20","v":28},null,{"$f":"IF(AND(K917<=$I$144,K917>=$I$145,L917>=$M$143,L917<=$N$143),MIN(ROUND(M917,2),633),\"\")","v":""}]
[null,null,null,null,null,null,null,null,"-550,270",null,14,28,null,""]
[null,null,null,null,null,null,null,null,"-550,250",null,13,28,null,""]
[null,null,null,null,null,null,null,null,"-550,230",null,12,28,null,""]
[null,null,null,null,null,null,null,null,"-550,210",null,11,28,null,""]
[null,null,null,null,null,null,null,null,"-550,190",null,10,28,null,""]
[null,null,null,null,null,null,null,null,"-550,170",null,9,28,null,""]
[null,null,null,null,null,null,null,null,"-550,150",null,8,28,null,""]
[null,null,null,null,null,null,null,null,"-550,130",null,7,28,null,""]
[null,null,null,null,null,null,null,null,"-550,110",null,6,28,null,""]
[null,null,null,null,null,null,null,null,"-550,90",null,5,28,null,""]
[null,null,null,null,null,null,null,null,"-550,70",null,4,28,null,""]
[null,null,null,null,null,null,null,null,"-550,50",null,3,28,null,""]
[null,null,null,null,null,null,null,null,"-550,30",null,2,28,null,""]
[null,null,null,null,null,null,null,null,"-550,10",null,1,28,null,""]
[null,null,null,null,null,null,null,null,"-570,550",null,28,29,null,""]
[null,null,null,null,null,null,null,null,"-570,530",null,27,29,null,""]
[null,null,null,null,null,null,null,null,"-570,510",null,26,29,null,""]
[null,null,null,null,null,null,null,null,"-570,490",null,25,29,null,""]
[null,null,null,null,null,null,null,null,"-570,470",null,24,29,null,""]
[null,null,null,null,null,null,null,null,"-570,450",null,23,29,null,""]
[null,null,null,null,null,null,null,null,"-570,430",null,22,29,null,""]
[null,null,null,null,null,null,null,null,"-570,410",null,21,29,null,""]
[null,null,null,null,null,null,null,null,"-570,390",null,20,29,null,""]
[null,null,null,null,null,null,null,null,"-570,370",null,19,29,null,""]
[null,null,null,null,null,null,null,null,"-570,350",null,18,29,null,""]
[null,null,null,null,null,null,null,null,"-570,330",null,17,29,null,""]
[null,null,null,null,null,null,null,null,"-570,310",null,16,29,null,""]
[null,null,null,null,null,null,null,null,"-570,290",null,15,29,null,""]
[null,null,null,null,null,null,null,null,"-570,270",null,14,29,null,""]
[null,null,null,null,null,null,null,null,"-570,250",null,13,29,null,""]
[null,null,null,null,null,null,null,null,"-570,230",null,12,29,null,""]
[null,null,null,null,null,null,null,null,"-570,210",null,11,29,null,""]
[null,null,null,null,null,null,null,null,"-570,190",null,10,29,null,""]
[null,null,null,null,null,null,null,null,"-570,170",null,9,29,null,""]
[null,null,null,null,null,null,null,null,"-570,150",null,8,29,null,""]
[null,null,null,null,null,null,null,null,"-570,130",null,7,29,null,""]
[null,null,null,null,null,null,null,null,"-570,110",null,6,29,null,""]
[null,null,null,null,null,null,null,null,"-570,90",null,5,29,null,""]
[null,null,null,null,null,null,null,null,"-570,70",null,4,29,null,""]
[null,null,null,null,null,null,null,null,"-570,50",null,3,29,null,""]
[null,null,null,null,null,null,null,null,"-570,30",null,2,29,null,""]
[null,null,null,null,null,null,null,null,"-570,10",null,1,29,null,""]
[null,null,null,null,null,null,null,null,"-590,550",null,28,30,null,""]
[null,null,null,null,null,null,null,null,"-590,530",null,27,30,null,""]
[null,null,null,null,null,null,null,null,"-590,510",null,26,30,null,""]
[null,null,null,null,null,null,null,null,"-590,490",null,25,30,null,""]
[null,null,null,null,null,null,null,null,"-590,470",null,24,30,null,""]
[null,null,null,null,null,null,null,null,"-590,450",null,23,30,null,""]
[null,null,null,null,null,null,null,null,"-590,430",null,22,30,null,""]
[null,null,null,null,null,null,null,null,"-590,410",null,21,30,null,""]
[null,null,null,null,null,null,null,null,"-590,390",null,20,30,null,""]
[null,null,null,null,null,null,null,null,"-590,370",null,19,30,null,""]
[null,null,null,null,null,null,null,null,"-590,350",null,18,30,null,""]
[null,null,null,null,null,null,null,null,"-590,330",null,17,30,null,""]
[null,null,null,null,null,null,null,null,"-590,310",null,16,30,null,""]
[null,null,null,null,null,null,null,null,"-590,290",null,15,30,null,""]
[null,null,null,null,null,null,null,null,"-590,270",null,14,30,null,""]
[null,null,null,null,null,null,null,null,"-590,250",null,13,30,null,""]
[null,null,null,null,null,null,null,null,"-590,230",null,12,30,null,""]
[null,null,null,null,null,null,null,null,"-590,210",null,11,30,null,""]
[null,null,null,null,null,null,null,null,"-590,190",null,10,30,null,""]
[null,null,null,null,null,null,null,null,"-590,170",null,9,30,null,""]
[null,null,null,null,null,null,null,null,"-590,150",null,8,30,null,""]
[null,null,null,null,null,null,null,null,"-590,130",null,{"$f":"1+(RIGHT(I981,LEN(I981)-FIND(\",\",I981))-10)/20","v":7},{"$f":"1+((LEFT(I981,FIND(\",\",I981)-1)*-1)-10)/20","v":30},null,{"$f":"IF(AND(K981<=$I$144,K981>=$I$145,L981>=$M$143,L981<=$N$143),MIN(ROUND(M981,2),633),\"\")","v":""}]
[null,null,null,null,null,null,null,null,"-590,110",null,6,30,null,""]
[null,null,null,null,null,null,null,null,"-590,90",null,5,30,null,""]
[null,null,null,null,null,null,null,null,"-590,70",null,4,30,null,""]
[null,null,null,null,null,null,null,null,"-590,50",null,3,30,null,""]
[null,null,null,null,null,null,null,null,"-590,30",null,2,30,null,""]
[null,null,null,null,null,null,null,null,"-590,10",null,1,30,null,""]
[null,null,null,null,null,null,null,null,"-610,550",null,28,31,null,""]
[null,null,null,null,null,null,null,null,"-610,530",null,27,31,null,""]
[null,null,null,null,null,null,null,null,"-610,510",null,26,31,null,""]
[null,null,null,null,null,null,null,null,"-610,490",null,25,31,null,""]
[null,null,null,null,null,null,null,null,"-610,470",null,24,31,null,""]
[null,null,null,null,null,null,null,null,"-610,450",null,23,31,null,""]
[null,null,null,null,null,null,null,null,"-610,430",null,22,31,null,""]
[null,null,null,null,null,null,null,null,"-610,410",null,21,31,null,""]
[null,null,null,null,null,null,null,null,"-610,390",null,20,31,null,""]
[null,null,null,null,null,null,null,null,"-610,370",null,19,31,null,""]
[null,null,null,null,null,null,null,null,"-610,350",null,18,31,null,""]
[null,null,null,null,null,null,null,null,"-610,330",null,17,31,null,""]
[null,null,null,null,null,null,null,null,"-610,310",null,16,31,null,""]
[null,null,null,null,null,null,null,null,"-610,290",null,15,31,null,""]
[null,null,null,null,null,null,null,null,"-610,270",null,14,31,null,""]
[null,null,null,null,null,null,null,null,"-610,250",null,13,31,null,""]
[null,null,null,null,null,null,null,null,"-610,230",null,12,31,null,""]
[null,null,null,null,null,null,null,null,"-610,210",null,11,31,null,""]
[null,null,null,null,null,null,null,null,"-610,190",null,10,31,null,""]
[null,null,null,null,null,null,null,null,"-610,170",null,9,31,null,""]
[null,null,null,null,null,null,null,null,"-610,150",null,8,31,null,""]
[null,null,null,null,null,null,null,null,"-610,130",null,7,31,null,""]
[null,null,null,null,null,null,null,null,"-610,110",null,6,31,null,""]
[null,null,null,null,null,null,null,null,"-610,90",null,5,31,null,""]
[null,null,null,null,null,null,null,null,"-610,70",null,4,31,null,""]
[null,null,null,null,null,null,null,null,"-610,50",null,3,31,null,""]
[null,null,null,null,null,null,null,null,"-610,30",null,2,31,null,""]
[null,null,null,null,null,null,null,null,"-610,10",null,1,31,null,""]
[null,null,null,null,null,null,null,null,"-630,550",null,28,32,null,""]
[null,null,null,null,null,null,null,null,"-630,530",null,27,32,null,""]
[null,null,null,null,null,null,null,null,"-630,510",null,26,32,null,""]
[null,null,null,null,null,null,null,null,"-630,490",null,25,32,null,""]
[null,null,null,null,null,null,null,null,"-630,470",null,24,32,null,""]
[null,null,null,null,null,null,null,null,"-630,450",null,23,32,null,""]
[null,null,null,null,null,null,null,null,"-630,430",null,22,32,null,""]
[null,null,null,null,null,null,null,null,"-630,410",null,21,32,null,""]
[null,null,null,null,null,null,null,null,"-630,390",null,20,32,null,""]
[null,null,null,null,null,null,null,null,"-630,370",null,19,32,null,""]
[null,null,null,null,null,null,null,null,"-630,350",null,18,32,null,""]
[null,null,null,null,null,null,null,null,"-630,330",null,17,32,null,""]
[null,null,null,null,null,null,null,null,"-630,310",null,16,32,null,""]
[null,null,null,null,null,null,null,null,"-630,290",null,15,32,null,""]
[null,null,null,null,null,null,null,null,"-630,270",null,14,32,null,""]
[null,null,null,null,null,null,null,null,"-630,250",null,13,32,null,""]
[null,null,null,null,null,null,null,null,"-630,230",null,12,32,null,""]
[null,null,null,null,null,null,null,null,"-630,210",null,11,32,null,""]
[null,null,null,null,null,null,null,null,"-630,190",null,10,32,null,""]
[null,null,null,null,null,null,null,null,"-630,170",null,9,32,null,""]
[null,null,null,null,null,null,null,null,"-630,150",null,8,32,null,""]
[null,null,null,null,null,null,null,null,"-630,130",null,7,32,null,""]
[null,null,null,null,null,null,null,null,"-630,110",null,6,32,null,""]
[null,null,null,null,null,null,null,null,"-630,90",null,5,32,null,""]
[null,null,null,null,null,null,null,null,"-630,70",null,4,32,null,""]
[null,null,null,null,null,null,null,null,"-630,50",null,3,32,null,""]
[null,null,null,null,null,null,null,null,"-630,30",null,2,32,null,""]
[null,null,null,null,null,null,null,null,"-630,10",null,1,32,null,""]
[null,null,null,null,null,null,null,null,"-650,550",null,28,33,null,""]
[null,null,null,null,null,null,null,null,"-650,530",null,{"$f":"1+(RIGHT(I1045,LEN(I1045)-FIND(\",\",I1045))-10)/20","v":27},{"$f":"1+((LEFT(I1045,FIND(\",\",I1045)-1)*-1)-10)/20","v":33},null,{"$f":"IF(AND(K1045<=$I$144,K1045>=$I$145,L1045>=$M$143,L1045<=$N$143),MIN(ROUND(M1045,2),633),\"\")","v":""}]
[null,null,null,null,null,null,null,null,"-650,510",null,26,33,null,""]
[null,null,null,null,null,null,null,null,"-650,490",null,25,33,null,""]
[null,null,null,null,null,null,null,null,"-650,470",null,24,33,null,""]
[null,null,null,null,null,null,null,null,"-650,450",null,23,33,null,""]
[null,null,null,null,null,null,null,null,"-650,430",null,22,33,null,""]
[null,null,null,null,null,null,null,null,"-650,410",null,21,33,null,""]
[null,null,null,null,null,null,null,null,"-650,390",null,20,33,null,""]
[null,null,null,null,null,null,null,null,"-650,370",null,19,33,null,""]
[null,null,null,null,null,null,null,null,"-650,350",null,18,33,null,""]
[null,null,null,null,null,null,null,null,"-650,330",null,17,33,null,""]
[null,null,null,null,null,null,null,null,"-650,310",null,16,33,null,""]
[null,null,null,null,null,null,null,null,"-650,290",null,15,33,null,""]
[null,null,null,null,null,null,null,null,"-650,270",null,14,33,null,""]
[null,null,null,null,null,null,null,null,"-650,250",null,13,33,null,""]
[null,null,null,null,null,null,null,null,"-650,230",null,12,33,null,""]
[null,null,null,null,null,null,null,null,"-650,210",null,11,33,null,""]
[null,null,null,null,null,null,null,null,"-650,190",null,10,33,null,""]
[null,null,null,null,null,null,null,null,"-650,170",null,9,33,null,""]
[null,null,null,null,null,null,null,null,"-650,150",null,8,33,null,""]
[null,null,null,null,null,null,null,null,"-650,130",null,7,33,null,""]
[null,null,null,null,null,null,null,null,"-650,110",null,6,33,null,""]
[null,null,null,null,null,null,null,null,"-650,90",null,5,33,null,""]
[null,null,null,null,null,null,null,null,"-650,70",null,4,33,null,""]
[null,null,null,null,null,null,null,null,"-650,50",null,3,33,null,""]
[null,null,null,null,null,null,null,null,"-650,30",null,2,33,null,""]
[null,null,null,null,null,null,null,null,"-650,10",null,1,33,null,""]
[null,null,null,null,null,null,null,null,"-670,550",null,28,34,null,""]
[null,null,null,null,null,null,null,null,"-670,530",null,27,34,null,""]
[null,null,null,null,null,null,null,null,"-670,510",null,26,34,null,""]
[null,null,null,null,null,null,null,null,"-670,490",null,25,34,null,""]
[null,null,null,null,null,null,null,null,"-670,470",null,24,34,null,""]
[null,null,null,null,null,null,null,null,"-670,450",null,23,34,null,""]
[null,null,null,null,null,null,null,null,"-670,430",null,22,34,null,""]
[null,null,null,null,null,null,null,null,"-670,410",null,21,34,null,""]
[null,null,null,null,null,null,null,null,"-670,390",null,20,34,null,""]
[null,null,null,null,null,null,null,null,"-670,370",null,19,34,null,""]
[null,null,null,null,null,null,null,null,"-670,350",null,18,34,null,""]
[null,null,null,null,null,null,null,null,"-670,330",null,17,34,null,""]
[null,null,null,null,null,null,null,null,"-670,310",null,16,34,null,""]
[null,null,null,null,null,null,null,null,"-670,290",null,15,34,null,""]
[null,null,null,null,null,null,null,null,"-670,270",null,14,34,null,""]
[null,null,null,null,null,null,null,null,"-670,250",null,13,34,null,""]
[null,null,null,null,null,null,null,null,"-670,230",null,12,34,null,""]
[null,null,null,null,null,null,null,null,"-670,210",null,11,34,null,""]
[null,null,null,null,null,null,null,null,"-670,190",null,10,34,null,""]
[null,null,null,null,null,null,null,null,"-670,170",null,9,34,null,""]
[null,null,null,null,null,null,null,null,"-670,150",null,8,34,null,""]
[null,null,null,null,null,null,null,null,"-670,130",null,7,34,null,""]
[null,null,null,null,null,null,null,null,"-670,110",null,6,34,null,""]
[null,null,null,null,null,null,null,null,"-670,90",null,5,34,null,""]
[null,null,null,null,null,null,null,null,"-670,70",null,4,34,null,""]
[null,null,null,null,null,null,null,null,"-670,50",null,3,34,null,""]
[null,null,null,null,null,null,null,null,"-670,30",null,2,34,null,""]
[null,null,null,null,null,null,null,null,"-670,10",null,1,34,null,""]
[null,null,null,null,null,null,null,null,"-690,550",null,28,35,null,""]
[null,null,null,null,null,null,null,null,"-690,530",null,27,35,null,""]
[null,null,null,null,null,null,null,null,"-690,510",null,26,35,null,""]
[null,null,null,null,null,null,null,null,"-690,490",null,25,35,null,""]
[null,null,null,null,null,null,null,null,"-690,470",null,24,35,null,""]
[null,null,null,null,null,null,null,null,"-690,450",null,23,35,null,""]
[null,null,null,null,null,null,null,null,"-690,430",null,22,35,null,""]
[null,null,null,null,null,null,null,null,"-690,410",null,21,35,null,""]
[null,null,null,null,null,null,null,null,"-690,390",null,20,35,null,""]
[null,null,null,null,null,null,null,null,"-690,370",null,{"$f":"1+(RIGHT(I1109,LEN(I1109)-FIND(\",\",I1109))-10)/20","v":19},{"$f":"1+((LEFT(I1109,FIND(\",\",I1109)-1)*-1)-10)/20","v":35},null,{"$f":"IF(AND(K1109<=$I$144,K1109>=$I$145,L1109>=$M$143,L1109<=$N$143),MIN(ROUND(M1109,2),633),\"\")","v":""}]
[null,null,null,null,null,null,null,null,"-690,350",null,18,35,null,""]
[null,null,null,null,null,null,null,null,"-690,330",null,17,35,null,""]
[null,null,null,null,null,null,null,null,"-690,310",null,16,35,null,""]
[null,null,null,null,null,null,null,null,"-690,290",null,15,35,null,""]
[null,null,null,null,null,null,null,null,"-690,270",null,14,35,null,""]
[null,null,null,null,null,null,null,null,"-690,250",null,13,35,null,""]
[null,null,null,null,null,null,null,null,"-690,230",null,12,35,null,""]
[null,null,null,null,null,null,null,null,"-690,210",null,11,35,null,""]
[null,null,null,null,null,null,null,null,"-690,190",null,10,35,null,""]
[null,null,null,null,null,null,null,null,"-690,170",null,9,35,null,""]
[null,null,null,null,null,null,null,null,"-690,150",null,8,35,null,""]
[null,null,null,null,null,null,null,null,"-690,130",null,7,35,null,""]
[null,null,null,null,null,null,null,null,"-690,110",null,6,35,null,""]
[null,null,null,null,null,null,null,null,"-690,90",null,5,35,null,""]
[null,null,null,null,null,null,null,null,"-690,70",null,4,35,null,""]
[null,null,null,null,null,null,null,null,"-690,50",null,3,35,null,""]
[null,null,null,null,null,null,null,null,"-690,30",null,2,35,null,""]
[null,null,null,null,null,null,null,null,"-690,10",null,1,35,null,""]
[null,null,null,null,null,null,null,null,"-710,550",null,28,36,null,""]
[null,null,null,null,null,null,null,null,"-710,530",null,27,36,null,""]
[null,null,null,null,null,null,null,null,"-710,510",null,26,36,null,""]
[null,null,null,null,null,null,null,null,"-710,490",null,25,36,null,""]
[null,null,null,null,null,null,null,null,"-710,470",null,24,36,null,""]
[null,null,null,null,null,null,null,null,"-710,450",null,23,36,null,""]
[null,null,null,null,null,null,null,null,"-710,430",null,22,36,null,""]
[null,null,null,null,null,null,null,null,"-710,410",null,21,36,null,""]
[null,null,null,null,null,null,null,null,"-710,390",null,20,36,null,""]
[null,null,null,null,null,null,null,null,"-710,370",null,19,36,null,""]
[null,null,null,null,null,null,null,null,"-710,350",null,18,36,null,""]
[null,null,null,null,null,null,null,null,"-710,330",null,17,36,null,""]
[null,null,null,null,null,null,null,null,"-710,310",null,16,36,null,""]
[null,null,null,null,null,null,null,null,"-710,290",null,15,36,null,""]
[null,null,null,null,null,null,null,null,"-710,270",null,14,36,null,""]
[null,null,null,null,null,null,null,null,"-710,250",null,13,36,null,""]
[null,null,null,null,null,null,null,null,"-710,230",null,12,36,null,""]
[null,null,null,null,null,null,null,null,"-710,210",null,11,36,null,""]
[null,null,null,null,null,null,null,null,"-710,190",null,10,36,null,""]
[null,null,null,null,null,null,null,null,"-710,170",null,9,36,null,""]
[null,null,null,null,null,null,null,null,"-710,150",null,8,36,null,""]
[null,null,null,null,null,null,null,null,"-710,130",null,7,36,null,""]
[null,null,null,null,null,null,null,null,"-710,110",null,6,36,null,""]
[null,null,null,null,null,null,null,null,"-710,90",null,5,36,null,""]
[null,null,null,null,null,null,null,null,"-710,70",null,4,36,null,""]
[null,null,null,null,null,null,null,null,"-710,50",null,3,36,null,""]
[null,null,null,null,null,null,null,null,"-710,30",null,2,36,null,""]
[null,null,null,null,null,null,null,null,"-710,10",null,1,36,null,""]
[null,null,null,null,null,null,null,null,"-730,550",null,28,37,null,""]
[null,null,null,null,null,null,null,null,"-730,530",null,27,37,null,""]
[null,null,null,null,null,null,null,null,"-730,510",null,26,37,null,""]
[null,null,null,null,null,null,null,null,"-730,490",null,25,37,null,""]
[null,null,null,null,null,null,null,null,"-730,470",null,24,37,null,""]
[null,null,null,null,null,null,null,null,"-730,450",null,23,37,null,""]
[null,null,null,null,null,null,null,null,"-730,430",null,22,37,null,""]
[null,null,null,null,null,null,null,null,"-730,410",null,21,37,null,""]
[null,null,null,null,null,null,null,null,"-730,390",null,20,37,null,""]
[null,null,null,null,null,null,null,null,"-730,370",null,19,37,null,""]
[null,null,null,null,null,null,null,null,"-730,350",null,18,37,null,""]
[null,null,null,null,null,null,null,null,"-730,330",null,17,37,null,""]
[null,null,null,null,null,null,null,null,"-730,310",null,16,37,null,""]
[null,null,null,null,null,null,null,null,"-730,290",null,15,37,null,""]
[null,null,null,null,null,null,null,null,"-730,270",null,14,37,null,""]
[null,null,null,null,null,null,null,null,"-730,250",null,13,37,null,""]
[null,null,null,null,null,null,null,null,"-730,230",null,12,37,null,""]
[null,null,null,null,null,null,null,null,"-730,210",null,{"$f":"1+(RIGHT(I1173,LEN(I1173)-FIND(\",\",I1173))-10)/20","v":11},{"$f":"1+((LEFT(I1173,FIND(\",\",I1173)-1)*-1)-10)/20","v":37},null,{"$f":"IF(AND(K1173<=$I$144,K1173>=$I$145,L1173>=$M$143,L1173<=$N$143),MIN(ROUND(M1173,2),633),\"\")","v":""}]
[null,null,null,null,null,null,null,null,"-730,190",null,10,37,null,""]
[null,null,null,null,null,null,null,null,"-730,170",null,9,37,null,""]
[null,null,null,null,null,null,null,null,"-730,150",null,8,37,null,""]
[null,null,null,null,null,null,null,null,"-730,130",null,7,37,null,""]
[null,null,null,null,null,null,null,null,"-730,110",null,6,37,null,""]
[null,null,null,null,null,null,null,null,"-730,90",null,5,37,null,""]
[null,null,null,null,null,null,null,null,"-730,70",null,4,37,null,""]
[null,null,null,null,null,null,null,null,"-730,50",null,3,37,null,""]
[null,null,null,null,null,null,null,null,"-730,30",null,2,37,null,""]
[null,null,null,null,null,null,null,null,"-730,10",null,1,37,null,""]
[null,null,null,null,null,null,null,null,"-750,550",null,28,38,null,""]
[null,null,null,null,null,null,null,null,"-750,530",null,27,38,null,""]
[null,null,null,null,null,null,null,null,"-750,510",null,26,38,null,""]
[null,null,null,null,null,null,null,null,"-750,490",null,25,38,null,""]
[null,null,null,null,null,null,null,null,"-750,470",null,24,38,null,""]
[null,null,null,null,null,null,null,null,"-750,450",null,23,38,null,""]
[null,null,null,null,null,null,null,null,"-750,430",null,22,38,null,""]
[null,null,null,null,null,null,null,null,"-750,410",null,21,38,null,""]
[null,null,null,null,null,null,null,null,"-750,390",null,20,38,null,""]
[null,null,null,null,null,null,null,null,"-750,370",null,19,38,null,""]
[null,null,null,null,null,null,null,null,"-750,350",null,18,38,null,""]
[null,null,null,null,null,null,null,null,"-750,330",null,17,38,null,""]
[null,null,null,null,null,null,null,null,"-750,310",null,16,38,null,""]
[null,null,null,null,null,null,null,null,"-750,290",null,15,38,null,""]
[null,null,null,null,null,null,null,null,"-750,270",null,14,38,null,""]
[null,null,null,null,null,null,null,null,"-750,250",null,13,38,null,""]
[null,null,null,null,null,null,null,null,"-750,230",null,12,38,null,""]
[null,null,null,null,null,null,null,null,"-750,210",null,11,38,null,""]
[null,null,null,null,null,null,null,null,"-750,190",null,10,38,null,""]
[null,null,null,null,null,null,null,null,"-750,170",null,9,38,null,""]
[null,null,null,null,null,null,null,null,"-750,150",null,8,38,null,""]
[null,null,null,null,null,null,null,null,"-750,130",null,7,38,null,""]
[null,null,null,null,null,null,null,null,"-750,110",null,6,38,null,""]
[null,null,null,null,null,null,null,null,"-750,90",null,5,38,null,""]
[null,null,null,null,null,null,null,null,"-750,70",null,4,38,null,""]
[null,null,null,null,null,null,null,null,"-750,50",null,3,38,null,""]
[null,null,null,null,null,null,null,null,"-750,30",null,2,38,null,""]
[null,null,null,null,null,null,null,null,"-750,10",null,1,38,null,""]
[null,null,null,null,null,null,null,null,"-770,550",null,28,39,null,""]
[null,null,null,null,null,null,null,null,"-770,530",null,27,39,null,""]
[null,null,null,null,null,null,null,null,"-770,510",null,26,39,null,""]
[null,null,null,null,null,null,null,null,"-770,490",null,25,39,null,""]
[null,null,null,null,null,null,null,null,"-770,470",null,24,39,null,""]
[null,null,null,null,null,null,null,null,"-770,450",null,23,39,null,""]
[null,null,null,null,null,null,null,null,"-770,430",null,22,39,null,""]
[null,null,null,null,null,null,null,null,"-770,410",null,21,39,null,""]
[null,null,null,null,null,null,null,null,"-770,390",null,20,39,null,""]
[null,null,null,null,null,null,null,null,"-770,370",null,19,39,null,""]
[null,null,null,null,null,null,null,null,"-770,350",null,18,39,null,""]
[null,null,null,null,null,null,null,null,"-770,330",null,17,39,null,""]
[null,null,null,null,null,null,null,null,"-770,310",null,16,39,null,""]
[null,null,null,null,null,null,null,null,"-770,290",null,15,39,null,""]
[null,null,null,null,null,null,null,null,"-770,270",null,14,39,null,""]
[null,null,null,null,null,null,null,null,"-770,250",null,13,39,null,""]
[null,null,null,null,null,null,null,null,"-770,230",null,12,39,null,""]
[null,null,null,null,null,null,null,null,"-770,210",null,11,39,null,""]
[null,null,null,null,null,null,null,null,"-770,190",null,10,39,null,""]
[null,null,null,null,null,null,null,null,"-770,170",null,9,39,null,""]
[null,null,null,null,null,null,null,null,"-770,150",null,8,39,null,""]
[null,null,null,null,null,null,null,null,"-770,130",null,7,39,null,""]
[null,null,null,null,null,null,null,null,"-770,110",null,6,39,null,""]
[null,null,null,null,null,null,null,null,"-770,90",null,5,39,null,""]
[null,null,null,null,null,null,null,null,"-770,70",null,4,39,null,""]
[null,null,null,null,null,null,null,null,"-770,50",null,{"$f":"1+(RIGHT(I1237,LEN(I1237)-FIND(\",\",I1237))-10)/20","v":3},{"$f":"1+((LEFT(I1237,FIND(\",\",I1237)-1)*-1)-10)/20","v":39},null,{"$f":"IF(AND(K1237<=$I$144,K1237>=$I$145,L1237>=$M$143,L1237<=$N$143),MIN(ROUND(M1237,2),633),\"\")","v":""}]
[null,null,null,null,null,null,null,null,"-770,30",null,2,39,null,""]
[null,null,null,null,null,null,null,null,"-770,10",null,1,39,null,""]
[null,null,null,null,null,null,null,null,"-790,550",null,28,40,null,""]
[null,null,null,null,null,null,null,null,"-790,530",null,27,40,null,""]
[null,null,null,null,null,null,null,null,"-790,510",null,26,40,null,""]
[null,null,null,null,null,null,null,null,"-790,490",null,25,40,null,""]
[null,null,null,null,null,null,null,null,"-790,470",null,24,40,null,""]
[null,null,null,null,null,null,null,null,"-790,450",null,23,40,null,""]
[null,null,null,null,null,null,null,null,"-790,430",null,22,40,null,""]
[null,null,null,null,null,null,null,null,"-790,410",null,21,40,null,""]
[null,null,null,null,null,null,null,null,"-790,390",null,20,40,null,""]
[null,null,null,null,null,null,null,null,"-790,370",null,19,40,null,""]
[null,null,null,null,null,null,null,null,"-790,350",null,18,40,null,""]
[null,null,null,null,null,null,null,null,"-790,330",null,17,40,null,""]
[null,null,null,null,null,null,null,null,"-790,310",null,16,40,null,""]
[null,null,null,null,null,null,null,null,"-790,290",null,15,40,null,""]
[null,null,null,null,null,null,null,null,"-790,270",null,14,40,null,""]
[null,null,null,null,null,null,null,null,"-790,250",null,13,40,null,""]
[null,null,null,null,null,null,null,null,"-790,230",null,12,40,null,""]
[null,null,null,null,null,null,null,null,"-790,210",null,11,40,null,""]
[null,null,null,null,null,null,null,null,"-790,190",null,10,40,null,""]
[null,null,null,null,null,null,null,null,"-790,170",null,9,40,null,""]
[null,null,null,null,null,null,null,null,"-790,150",null,8,40,null,""]
[null,null,null,null,null,null,null,null,"-790,130",null,7,40,null,""]
[null,null,null,null,null,null,null,null,"-790,110",null,6,40,null,""]
[null,null,null,null,null,null,null,null,"-790,90",null,5,40,null,""]
[null,null,null,null,null,null,null,null,"-790,70",null,4,40,null,""]
[null,null,null,null,null,null,null,null,"-790,50",null,3,40,null,""]
[null,null,null,null,null,null,null,null,"-790,30",null,2,40,null,""]
[null,null,null,null,null,null,null,null,"-790,10",null,1,40,null,""]
[null,null,null,null,null,null,null,null,"-810,550",null,28,41,null,""]
[null,null,null,null,null,null,null,null,"-810,530",null,27,41,null,""]
[null,null,null,null,null,null,null,null,"-810,510",null,26,41,null,""]
[null,null,null,null,null,null,null,null,"-810,490",null,25,41,null,""]
[null,null,null,null,null,null,null,null,"-810,470",null,24,41,null,""]
[null,null,null,null,null,null,null,null,"-810,450",null,23,41,null,""]
[null,null,null,null,null,null,null,null,"-810,430",null,22,41,null,""]
[null,null,null,null,null,null,null,null,"-810,410",null,21,41,null,""]
[null,null,null,null,null,null,null,null,"-810,390",null,20,41,null,""]
[null,null,null,null,null,null,null,null,"-810,370",null,19,41,null,""]
[null,null,null,null,null,null,null,null,"-810,350",null,18,41,null,""]
[null,null,null,null,null,null,null,null,"-810,330",null,17,41,null,""]
[null,null,null,null,null,null,null,null,"-810,310",null,16,41,null,""]
[null,null,null,null,null,null,null,null,"-810,290",null,15,41,null,""]
[null,null,null,null,null,null,null,null,"-810,270",null,14,41,null,""]
[null,null,null,null,null,null,null,null,"-810,250",null,13,41,null,""]
[null,null,null,null,null,null,null,null,"-810,230",null,12,41,null,""]
[null,null,null,null,null,null,null,null,"-810,210",null,11,41,null,""]
[null,null,null,null,null,null,null,null,"-810,190",null,10,41,null,""]
[null,null,null,null,null,null,null,null,"-810,170",null,9,41,null,""]
[null,null,null,null,null,null,null,null,"-810,150",null,8,41,null,""]
[null,null,null,null,null,null,null,null,"-810,130",null,7,41,null,""]
[null,null,null,null,null,null,null,null,"-810,110",null,6,41,null,""]
[null,null,null,null,null,null,null,null,"-810,90",null,5,41,null,""]
[null,null,null,null,null,null,null,null,"-810,70",null,4,41,null,""]
[null,null,null,null,null,null,null,null,"-810,50",null,3,41,null,""]
[null,null,null,null,null,null,null,null,"-810,30",null,2,41,null,""]
[null,null,null,null,null,null,null,null,"-810,10",null,1,41,null,""]
[null,null,null,null,null,null,null,null,"-830,550",null,28,42,null,""]
[null,null,null,null,null,null,null,null,"-830,530",null,27,42,null,""]
[null,null,null,null,null,null,null,null,"-830,510",null,26,42,null,""]
[null,null,null,null,null,null,null,null,"-830,490",null,25,42,null,""]
[null,null,null,null,null,null,null,null,"-830,470",null,24,42,null,""]
[null,null,null,null,null,null,null,null,"-830,450",null,{"$f":"1+(RIGHT(I1301,LEN(I1301)-FIND(\",\",I1301))-10)/20","v":23},{"$f":"1+((LEFT(I1301,FIND(\",\",I1301)-1)*-1)-10)/20","v":42},null,{"$f":"IF(AND(K1301<=$I$144,K1301>=$I$145,L1301>=$M$143,L1301<=$N$143),MIN(ROUND(M1301,2),633),\"\")","v":""}]
[null,null,null,null,null,null,null,null,"-830,430",null,22,42,null,""]
[null,null,null,null,null,null,null,null,"-830,410",null,21,42,null,""]
[null,null,null,null,null,null,null,null,"-830,390",null,20,42,null,""]
[null,null,null,null,null,null,null,null,"-830,370",null,19,42,null,""]
[null,null,null,null,null,null,null,null,"-830,350",null,18,42,null,""]
[null,null,null,null,null,null,null,null,"-830,330",null,17,42,null,""]
[null,null,null,null,null,null,null,null,"-830,310",null,16,42,null,""]
[null,null,null,null,null,null,null,null,"-830,290",null,15,42,null,""]
[null,null,null,null,null,null,null,null,"-830,270",null,14,42,null,""]
[null,null,null,null,null,null,null,null,"-830,250",null,13,42,null,""]
[null,null,null,null,null,null,null,null,"-830,230",null,12,42,null,""]
[null,null,null,null,null,null,null,null,"-830,210",null,11,42,null,""]
[null,null,null,null,null,null,null,null,"-830,190",null,10,42,null,""]
[null,null,null,null,null,null,null,null,"-830,170",null,9,42,null,""]
[null,null,null,null,null,null,null,null,"-830,150",null,8,42,null,""]
[null,null,null,null,null,null,null,null,"-830,130",null,7,42,null,""]
[null,null,null,null,null,null,null,null,"-830,110",null,6,42,null,""]
[null,null,null,null,null,null,null,null,"-830,90",null,5,42,null,""]
[null,null,null,null,null,null,null,null,"-830,70",null,4,42,null,""]
[null,null,null,null,null,null,null,null,"-830,50",null,3,42,null,""]
[null,null,null,null,null,null,null,null,"-830,30",null,2,42,null,""]
[null,null,null,null,null,null,null,null,"-830,10",null,1,42,null,""]
[null,null,null,null,null,null,null,null,"-850,550",null,28,43,null,""]
[null,null,null,null,null,null,null,null,"-850,530",null,27,43,null,""]
[null,null,null,null,null,null,null,null,"-850,510",null,26,43,null,""]
[null,null,null,null,null,null,null,null,"-850,490",null,25,43,null,""]
[null,null,null,null,null,null,null,null,"-850,470",null,24,43,null,""]
[null,null,null,null,null,null,null,null,"-850,450",null,23,43,null,""]
[null,null,null,null,null,null,null,null,"-850,430",null,22,43,null,""]
[null,null,null,null,null,null,null,null,"-850,410",null,21,43,null,""]
[null,null,null,null,null,null,null,null,"-850,390",null,20,43,null,""]
[null,null,null,null,null,null,null,null,"-850,370",null,19,43,null,""]
[null,null,null,null,null,null,null,null,"-850,350",null,18,43,null,""]
[null,null,null,null,null,null,null,null,"-850,330",null,17,43,null,""]
[null,null,null,null,null,null,null,null,"-850,310",null,16,43,null,""]
[null,null,null,null,null,null,null,null,"-850,290",null,15,43,null,""]
[null,null,null,null,null,null,null,null,"-850,270",null,14,43,null,""]
[null,null,null,null,null,null,null,null,"-850,250",null,13,43,null,""]
[null,null,null,null,null,null,null,null,"-850,230",null,12,43,null,""]
[null,null,null,null,null,null,null,null,"-850,210",null,11,43,null,""]
[null,null,null,null,null,null,null,null,"-850,190",null,10,43,null,""]
[null,null,null,null,null,null,null,null,"-850,170",null,9,43,null,""]
[null,null,null,null,null,null,null,null,"-850,150",null,8,43,null,""]
[null,null,null,null,null,null,null,null,"-850,130",null,7,43,null,""]
[null,null,null,null,null,null,null,null,"-850,110",null,6,43,null,""]
[null,null,null,null,null,null,null,null,"-850,90",null,5,43,null,""]
[null,null,null,null,null,null,null,null,"-850,70",null,4,43,null,""]
[null,null,null,null,null,null,null,null,"-850,50",null,3,43,null,""]
[null,null,null,null,null,null,null,null,"-850,30",null,2,43,null,""]
[null,null,null,null,null,null,null,null,"-850,10",null,1,43,null,""]
[null,null,null,null,null,null,null,null,"-870,550",null,28,44,null,""]
[null,null,null,null,null,null,null,null,"-870,530",null,27,44,null,""]
[null,null,null,null,null,null,null,null,"-870,510",null,26,44,null,""]
[null,null,null,null,null,null,null,null,"-870,490",null,25,44,null,""]
[null,null,null,null,null,null,null,null,"-870,470",null,24,44,null,""]
[null,null,null,null,null,null,null,null,"-870,450",null,23,44,null,""]
[null,null,null,null,null,null,null,null,"-870,430",null,22,44,null,""]
[null,null,null,null,null,null,null,null,"-870,410",null,21,44,null,""]
[null,null,null,null,null,null,null,null,"-870,390",null,20,44,null,""]
[null,null,null,null,null,null,null,null,"-870,370",null,19,44,null,""]
[null,null,null,null,null,null,null,null,"-870,350",null,18,44,null,""]
[null,null,null,null,null,null,null,null,"-870,330",null,17,44,null,""]
[null,null,null,null,null,null,null,null,"-870,310",null,16,44,null,""]
[null,null,null,null,null,null,null,null,"-870,290",null,{"$f":"1+(RIGHT(I1365,LEN(I1365)-FIND(\",\",I1365))-10)/20","v":15},{"$f":"1+((LEFT(I1365,FIND(\",\",I1365)-1)*-1)-10)/20","v":44},null,{"$f":"IF(AND(K1365<=$I$144,K1365>=$I$145,L1365>=$M$143,L1365<=$N$143),MIN(ROUND(M1365,2),633),\"\")","v":""}]
[null,null,null,null,null,null,null,null,"-870,270",null,14,44,null,""]
[null,null,null,null,null,null,null,null,"-870,250",null,13,44,null,""]
[null,null,null,null,null,null,null,null,"-870,230",null,12,44,null,""]
[null,null,null,null,null,null,null,null,"-870,210",null,11,44,null,""]
[null,null,null,null,null,null,null,null,"-870,190",null,10,44,null,""]
[null,null,null,null,null,null,null,null,"-870,170",null,9,44,null,""]
[null,null,null,null,null,null,null,null,"-870,150",null,8,44,null,""]
[null,null,null,null,null,null,null,null,"-870,130",null,7,44,null,""]
[null,null,null,null,null,null,null,null,"-870,110",null,6,44,null,""]
[null,null,null,null,null,null,null,null,"-870,90",null,5,44,null,""]
[null,null,null,null,null,null,null,null,"-870,70",null,4,44,null,""]
[null,null,null,null,null,null,null,null,"-870,50",null,3,44,null,""]
[null,null,null,null,null,null,null,null,"-870,30",null,2,44,null,""]
[null,null,null,null,null,null,null,null,"-870,10",null,1,44,null,""]
[null,null,null,null,null,null,null,null,"-890,550",null,28,45,null,""]
[null,null,null,null,null,null,null,null,"-890,530",null,27,45,null,""]
[null,null,null,null,null,null,null,null,"-890,510",null,26,45,null,""]
[null,null,null,null,null,null,null,null,"-890,490",null,25,45,null,""]
[null,null,null,null,null,null,null,null,"-890,470",null,24,45,null,""]
[null,null,null,null,null,null,null,null,"-890,450",null,23,45,null,""]
[null,null,null,null,null,null,null,null,"-890,430",null,22,45,null,""]
[null,null,null,null,null,null,null,null,"-890,410",null,21,45,null,""]
[null,null,null,null,null,null,null,null,"-890,390",null,20,45,null,""]
[null,null,null,null,null,null,null,null,"-890,370",null,19,45,null,""]
[null,null,null,null,null,null,null,null,"-890,350",null,18,45,null,""]
[null,null,null,null,null,null,null,null,"-890,330",null,17,45,null,""]
[null,null,null,null,null,null,null,null,"-890,310",null,16,45,null,""]
[null,null,null,null,null,null,null,null,"-890,290",null,15,45,null,""]
[null,null,null,null,null,null,null,null,"-890,270",null,14,45,null,""]
[null,null,null,null,null,null,null,null,"-890,250",null,13,45,null,""]
[null,null,null,null,null,null,null,null,"-890,230",null,12,45,null,""]
[null,null,null,null,null,null,null,null,"-890,210",null,11,45,null,""]
[null,null,null,null,null,null,null,null,"-890,190",null,10,45,null,""]
[null,null,null,null,null,null,null,null,"-890,170",null,9,45,null,""]
[null,null,null,null,null,null,null,null,"-890,150",null,8,45,null,""]
[null,null,null,null,null,null,null,null,"-890,130",null,7,45,null,""]
[null,null,null,null,null,null,null,null,"-890,110",null,6,45,null,""]
[null,null,null,null,null,null,null,null,"-890,90",null,5,45,null,""]
[null,null,null,null,null,null,null,null,"-890,70",null,4,45,null,""]
[null,null,null,null,null,null,null,null,"-890,50",null,3,45,null,""]
[null,null,null,null,null,null,null,null,"-890,30",null,2,45,null,""]
[null,null,null,null,null,null,null,null,"-890,10",null,1,45,null,""]
[null,null,null,null,null,null,null,null,"-910,550",null,28,46,null,""]
[null,null,null,null,null,null,null,null,"-910,530",null,27,46,null,""]
[null,null,null,null,null,null,null,null,"-910,510",null,26,46,null,""]
[null,null,null,null,null,null,null,null,"-910,490",null,25,46,null,""]
[null,null,null,null,null,null,null,null,"-910,470",null,24,46,null,""]
[null,null,null,null,null,null,null,null,"-910,450",null,23,46,null,""]
[null,null,null,null,null,null,null,null,"-910,430",null,22,46,null,""]
[null,null,null,null,null,null,null,null,"-910,410",null,21,46,null,""]
[null,null,null,null,null,null,null,null,"-910,390",null,20,46,null,""]
[null,null,null,null,null,null,null,null,"-910,370",null,19,46,null,""]
[null,null,null,null,null,null,null,null,"-910,350",null,18,46,null,""]
[null,null,null,null,null,null,null,null,"-910,330",null,17,46,null,""]
[null,null,null,null,null,null,null,null,"-910,310",null,16,46,null,""]
[null,null,null,null,null,null,null,null,"-910,290",null,15,46,null,""]
[null,null,null,null,null,null,null,null,"-910,270",null,14,46,null,""]
[null,null,null,null,null,null,null,null,"-910,250",null,13,46,null,""]
[null,null,null,null,null,null,null,null,"-910,230",null,12,46,null,""]
[null,null,null,null,null,null,null,null,"-910,210",null,11,46,null,""]
[null,null,null,null,null,null,null,null,"-910,190",null,10,46,null,""]
[null,null,null,null,null,null,null,null,"-910,170",null,9,46,null,""]
[null,null,null,null,null,null,null,null,"-910,150",null,8,46,null,""]
[null,null,null,null,null,null,null,null,"-910,130",null,{"$f":"1+(RIGHT(I1429,LEN(I1429)-FIND(\",\",I1429))-10)/20","v":7},{"$f":"1+((LEFT(I1429,FIND(\",\",I1429)-1)*-1)-10)/20","v":46},null,{"$f":"IF(AND(K1429<=$I$144,K1429>=$I$145,L1429>=$M$143,L1429<=$N$143),MIN(ROUND(M1429,2),633),\"\")","v":""}]
[null,null,null,null,null,null,null,null,"-910,110",null,6,46,null,""]
[null,null,null,null,null,null,null,null,"-910,90",null,5,46,null,""]
[null,null,null,null,null,null,null,null,"-910,70",null,4,46,null,""]
[null,null,null,null,null,null,null,null,"-910,50",null,3,46,null,""]
[null,null,null,null,null,null,null,null,"-910,30",null,2,46,null,""]
[null,null,null,null,null,null,null,null,"-910,10",null,1,46,null,""]
[null,null,null,null,null,null,null,null,"-930,550",null,28,47,null,""]
[null,null,null,null,null,null,null,null,"-930,530",null,27,47,null,""]
[null,null,null,null,null,null,null,null,"-930,510",null,26,47,null,""]
[null,null,null,null,null,null,null,null,"-930,490",null,25,47,null,""]
[null,null,null,null,null,null,null,null,"-930,470",null,24,47,null,""]
[null,null,null,null,null,null,null,null,"-930,450",null,23,47,null,""]
[null,null,null,null,null,null,null,null,"-930,430",null,22,47,null,""]
[null,null,null,null,null,null,null,null,"-930,410",null,21,47,null,""]
[null,null,null,null,null,null,null,null,"-930,390",null,20,47,null,""]
[null,null,null,null,null,null,null,null,"-930,370",null,19,47,null,""]
[null,null,null,null,null,null,null,null,"-930,350",null,18,47,null,""]
[null,null,null,null,null,null,null,null,"-930,330",null,17,47,null,""]
[null,null,null,null,null,null,null,null,"-930,310",null,16,47,null,""]
[null,null,null,null,null,null,null,null,"-930,290",null,15,47,null,""]
[null,null,null,null,null,null,null,null,"-930,270",null,14,47,null,""]
[null,null,null,null,null,null,null,null,"-930,250",null,13,47,null,""]
[null,null,null,null,null,null,null,null,"-930,230",null,12,47,null,""]
[null,null,null,null,null,null,null,null,"-930,210",null,11,47,null,""]
[null,null,null,null,null,null,null,null,"-930,190",null,10,47,null,""]
[null,null,null,null,null,null,null,null,"-930,170",null,9,47,null,""]
[null,null,null,null,null,null,null,null,"-930,150",null,8,47,null,""]
[null,null,null,null,null,null,null,null,"-930,130",null,7,47,null,""]
[null,null,null,null,null,null,null,null,"-930,110",null,6,47,null,""]
[null,null,null,null,null,null,null,null,"-930,90",null,5,47,null,""]
[null,null,null,null,null,null,null,null,"-930,70",null,4,47,null,""]
[null,null,null,null,null,null,null,null,"-930,50",null,3,47,null,""]
[null,null,null,null,null,null,null,null,"-930,30",null,2,47,null,""]
[null,null,null,null,null,null,null,null,"-930,10",null,1,47,null,""]
[null,null,null,null,null,null,null,null,"-950,550",null,28,48,null,""]
[null,null,null,null,null,null,null,null,"-950,530",null,27,48,null,""]
[null,null,null,null,null,null,null,null,"-950,510",null,26,48,null,""]
[null,null,null,null,null,null,null,null,"-950,490",null,25,48,null,""]
[null,null,null,null,null,null,null,null,"-950,470",null,24,48,null,""]
[null,null,null,null,null,null,null,null,"-950,450",null,23,48,null,""]
[null,null,null,null,null,null,null,null,"-950,430",null,22,48,null,""]
[null,null,null,null,null,null,null,null,"-950,410",null,21,48,null,""]
[null,null,null,null,null,null,null,null,"-950,390",null,20,48,null,""]
[null,null,null,null,null,null,null,null,"-950,370",null,19,48,null,""]
[null,null,null,null,null,null,null,null,"-950,350",null,18,48,null,""]
[null,null,null,null,null,null,null,null,"-950,330",null,17,48,null,""]
[null,null,null,null,null,null,null,null,"-950,310",null,16,48,null,""]
[null,null,null,null,null,null,null,null,"-950,290",null,15,48,null,""]
[null,null,null,null,null,null,null,null,"-950,270",null,14,48,null,""]
[null,null,null,null,null,null,null,null,"-950,250",null,13,48,null,""]
[null,null,null,null,null,null,null,null,"-950,230",null,12,48,null,""]
[null,null,null,null,null,null,null,null,"-950,210",null,11,48,null,""]
[null,null,null,null,null,null,null,null,"-950,190",null,10,48,null,""]
[null,null,null,null,null,null,null,null,"-950,170",null,9,48,null,""]
[null,null,null,null,null,null,null,null,"-950,150",null,8,48,null,""]
[null,null,null,null,null,null,null,null,"-950,130",null,7,48,null,""]
[null,null,null,null,null,null,null,null,"-950,110",null,6,48,null,""]
[null,null,null,null,null,null,null,null,"-950,90",null,5,48,null,""]
[null,null,null,null,null,null,null,null,"-950,70",null,4,48,null,""]
[null,null,null,null,null,null,null,null,"-950,50",null,3,48,null,""]
[null,null,null,null,null,null,null,null,"-950,30",null,2,48,null,""]
[null,null,null,null,null,null,null,null,"-950,10",null,1,48,null,""]
[null,null,null,null,null,null,null,null,"-970,550",null,28,49,null,""]
[null,null,null,null,null,null,null,null,"-970,530",null,{"$f":"1+(RIGHT(I1493,LEN(I1493)-FIND(\",\",I1493))-10)/20","v":27},{"$f":"1+((LEFT(I1493,FIND(\",\",I1493)-1)*-1)-10)/20","v":49},null,{"$f":"IF(AND(K1493<=$I$144,K1493>=$I$145,L1493>=$M$143,L1493<=$N$143),MIN(ROUND(M1493,2),633),\"\")","v":""}]
[null,null,null,null,null,null,null,null,"-970,510",null,26,49,null,""]
[null,null,null,null,null,null,null,null,"-970,490",null,25,49,null,""]
[null,null,null,null,null,null,null,null,"-970,470",null,24,49,null,""]
[null,null,null,null,null,null,null,null,"-970,450",null,23,49,null,""]
[null,null,null,null,null,null,null,null,"-970,430",null,22,49,null,""]
[null,null,null,null,null,null,null,null,"-970,410",null,21,49,null,""]
[null,null,null,null,null,null,null,null,"-970,390",null,20,49,null,""]
[null,null,null,null,null,null,null,null,"-970,370",null,19,49,null,""]
[null,null,null,null,null,null,null,null,"-970,350",null,18,49,null,""]
[null,null,null,null,null,null,null,null,"-970,330",null,17,49,null,""]
[null,null,null,null,null,null,null,null,"-970,310",null,16,49,null,""]
[null,null,null,null,null,null,null,null,"-970,290",null,15,49,null,""]
[null,null,null,null,null,null,null,null,"-970,270",null,14,49,null,""]
[null,null,null,null,null,null,null,null,"-970,250",null,13,49,null,""]
[null,null,null,null,null,null,null,null,"-970,230",null,12,49,null,""]
[null,null,null,null,null,null,null,null,"-970,210",null,11,49,null,""]
[null,null,null,null,null,null,null,null,"-970,190",null,10,49,null,""]
[null,null,null,null,null,null,null,null,"-970,170",null,9,49,null,""]
[null,null,null,null,null,null,null,null,"-970,150",null,8,49,null,""]
[null,null,null,null,null,null,null,null,"-970,130",null,7,49,null,""]
[null,null,null,null,null,null,null,null,"-970,110",null,6,49,null,""]
[null,null,null,null,null,null,null,null,"-970,90",null,5,49,null,""]
[null,null,null,null,null,null,null,null,"-970,70",null,4,49,null,""]
[null,null,null,null,null,null,null,null,"-970,50",null,3,49,null,""]
[null,null,null,null,null,null,null,null,"-970,30",null,2,49,null,""]
[null,null,null,null,null,null,null,null,"-970,10",null,1,49,null,""]
[null,null,null,null,null,null,null,null,"-990,550",null,28,50,null,""]
[null,null,null,null,null,null,null,null,"-990,530",null,27,50,null,""]
[null,null,null,null,null,null,null,null,"-990,510",null,26,50,null,""]
[null,null,null,null,null,null,null,null,"-990,490",null,25,50,null,""]
[null,null,null,null,null,null,null,null,"-990,470",null,24,50,null,""]
[null,null,null,null,null,null,null,null,"-990,450",null,23,50,null,""]
[null,null,null,null,null,null,null,null,"-990,430",null,22,50,null,""]
[null,null,null,null,null,null,null,null,"-990,410",null,21,50,null,""]
[null,null,null,null,null,null,null,null,"-990,390",null,20,50,null,""]
[null,null,null,null,null,null,null,null,"-990,370",null,19,50,null,""]
[null,null,null,null,null,null,null,null,"-990,350",null,18,50,null,""]
[null,null,null,null,null,null,null,null,"-990,330",null,17,50,null,""]
[null,null,null,null,null,null,null,null,"-990,310",null,16,50,null,""]
[null,null,null,null,null,null,null,null,"-990,290",null,15,50,null,""]
[null,null,null,null,null,null,null,null,"-990,270",null,14,50,null,""]
[null,null,null,null,null,null,null,null,"-990,250",null,13,50,null,""]
[null,null,null,null,null,null,null,null,"-990,230",null,12,50,null,""]
[null,null,null,null,null,null,null,null,"-990,210",null,11,50,null,""]
[null,null,null,null,null,null,null,null,"-990,190",null,10,50,null,""]
[null,null,null,null,null,null,null,null,"-990,170",null,9,50,null,""]
[null,null,null,null,null,null,null,null,"-990,150",null,8,50,null,""]
[null,null,null,null,null,null,null,null,"-990,130",null,7,50,null,""]
[null,null,null,null,null,null,null,null,"-990,110",null,6,50,null,""]
[null,null,null,null,null,null,null,null,"-990,90",null,5,50,null,""]
[null,null,null,null,null,null,null,null,"-990,70",null,4,50,null,""]
[null,null,null,null,null,null,null,null,"-990,50",null,3,50,null,""]
[null,null,null,null,null,null,null,null,"-990,30",null,2,50,null,""]
[null,null,null,null,null,null,null,null,"-990,10",null,1,50,null,""]

{"sheet":"AOP Frontal FW","index":3,"n_rows":207,"n_cols":9,"rows_kept":207,"cut":false,"hidden":false,"merged":[[198,1,198,4],[68,1,68,8],[56,3,56,4],[56,7,56,8],[62,1,62,2],[62,3,62,8],[60,1,60,2],[60,3,60,8],[183,1,183,4],[58,1,58,2],[58,3,58,4],[58,5,58,6],[56,5,56,6],[57,5,57,6],[57,3,57,4],[61,3,61,8],[33,1,33,2],[57,7,57,8],[19,1,19,2],[19,3,19,4],[19,7,19,8],[19,5,19,6],[20,5,20,6],[40,1,40,2],[53,1,53,2],[55,5,55,6],[42,3,42,4],[42,7,42,8],[42,1,42,2],[37,1,37,2],[1,1,2,2],[1,3,2,4],[1,7,2,8],[3,1,3,2],[14,3,14,4],[14,7,14,8],[13,1,13,2],[13,3,13,4],[13,7,13,8],[1,5,2,6],[13,5,13,6],[14,5,14,6],[58,7,58,8],[20,7,20,8],[20,3,20,4],[28,3,28,4],[55,3,55,4],[55,7,55,8],[54,3,54,4],[54,7,54,8],[54,5,54,6],[27,7,27,8],[27,3,27,4],[27,5,27,6],[28,7,28,8],[28,5,28,6],[42,5,42,6]]}
[]
[null,"Frontal FW Test",null,"Driver",null,"Front Passenger",null,"Rear Passenger"]
[]
[null,{"$f":"'General Overview'!G5","v":""},null,"Value","Points","Value","Points","Value","Points"]
[null,"HEAD"]
[null,null,"Steering wheel airbag present? ",null,null,null,null,"Contact?"]
[null,null,"Peak resultant acceleration - g",null,{"$f":"IF(D6=\"Yes\",IF(D7<80,4,\"\"),0)","v":0},null,{"$f":"IF(F7=\"\",0,IF(F7<80,4,\"\"))","v":0},null,{"$f":"IF(I6=\"Yes\",IF(H7<80,4,\"\"),\"\")","v":""}]
[null,null,"HIC15",null,{"$f":"IF(D6=\"Yes\",IF(D7<80,\"\",ROUND(Sliding_Scale(D8,500,700,4,0),Round)),\"\")","v":""},null,{"$f":"IF(F7<80,\"\",ROUND(Sliding_Scale(F8,500,700,4,0),Round))","v":""},null,{"$f":"IF(I6=\"Yes\",IF(H7<80,\"\",ROUND(Sliding_Scale(H8,500,700,4,0),Round)),\"\")","v":""}]
[null,null,"Resultant Acc. 3 msec exeedence - g",null,{"$f":"IF(D6=\"Yes\",IF(D7<80,\"\",ROUND(Sliding_Scale(D9,72,80,4,0),Round)),\"\")","v":""},null,{"$f":"IF(F7<80,\"\",ROUND(Sliding_Scale(F9,72,80,4,0),Round))","v":""},null,{"$f":"IF(I6=\"No\",ROUND(Sliding_Scale(H9,72,80,4,0),Round),\"\")","v":""}]
[null,null,"Airbag contact modifier (-1)",null,{"$f":"D10","v":0},null,{"$f":"F10","v":0},null,{"$f":"H10","v":0}]
[null,null,"Hazardous airbag deployment modifier (-1)",null,{"$f":"D11","v":0},null,{"$f":"F11","v":0},null,{"$f":"H11","v":0}]
[null,null,"Incorrect airbag deployment modifier (-1)",null,{"$f":"D12","v":0},null,{"$f":"F12","v":0},null,{"$f":"H12","v":0}]
[null,null,"Head Excursion (-2/-4)",null,null,null,null,null,{"$f":"H13","v":0}]
[null,"Head Assessment",null,{"$f":"MAX(IF(D6=\"Yes\",MIN(E7:E9)+SUM(E10:E12),0))","v":0},null,{"$f":"MAX(MIN(G7:G9)+SUM(G10:G12),0)","v":0},null,{"$f":"MAX(MIN(I7:I9)+SUM(I10:I13),0)","v":0}]
[]
[null,"NECK"]
[null,null,"Shear level exceeded - kN",null,{"$f":"ROUND(Sliding_Scale(D17,1.2,1.95,4,0),Round)","v":0},null,{"$f":"ROUND(Sliding_Scale(F17,1.2,1.95,4,0),Round)","v":0},null,{"$f":"ROUND(Sliding_Scale(H17,1.2,1.95,1,0),Round)","v":0}]
[null,null,"Tension level exceeded - kN",null,{"$f":"ROUND(Sliding_Scale(D18,1.7,2.62,4,0),Round)","v":0},null,{"$f":"ROUND(Sliding_Scale(F18,1.7,2.62,4,0),Round)","v":0},null,{"$f":"ROUND(Sliding_Scale(H18,1.7,2.62,1,0),Round)","v":0}]
[null,null,"Extension - Nm",null,{"$f":"ROUND(Sliding_Scale(D19,36,49,4,0),Round)","v":0},null,{"$f":"ROUND(Sliding_Scale(F19,36,49,4,0),Round)","v":0},null,{"$f":"ROUND(Sliding_Scale(H19,36,49,2,0),Round)","v":0}]
[null,"Neck assessment",null,{"$f":"IF(D6=\"Yes\",MIN(E17:E19),0)","v":0},null,{"$f":"MIN(G17:G19)","v":0},null,{"$f":"SUM(I17:I19)","v":0}]
[]
[null,"CHEST"]
[null,null,"Compression - mm",null,{"$f":"ROUND(Sliding_Scale(D23,18,34,4,0),Round)","v":0},null,{"$f":"ROUND(Sliding_Scale(F23,18,34,4,0),Round)","v":0},null,{"$f":"ROUND(Sliding_Scale(H23,18,34,4,0),Round)","v":0}]
[null,null,"Viscous criterion - m/s",null,{"$f":"ROUND(Sliding_Scale(D24,0.5,1,4,0),Round)","v":0},null,{"$f":"ROUND(Sliding_Scale(F24,0.5,1,4,0),Round)","v":0},null,{"$f":"ROUND(Sliding_Scale(H24,0.5,1,4,0),Round)","v":0}]
[null,null,"Shoulder belt load - kN (-2)",null,{"$f":"IF(D25>6,-2,0)","v":0},null,{"$f":"IF(F25>6,-2,0)","v":0},null,{"$f":"IF(H25>6,-2,0)","v":0}]
[null,null,"Incorrect airbag deployment modifier (-1)",null,{"$f":"D26","v":0},null,null,null,{"$f":"H26","v":0}]
[null,null,"Steering wheel contact (-1) ",null,{"$f":"D27","v":0}]
[null,"Chest assessment",null,{"$f":"MAX(MIN(E23:E24)+E25+E26+E27,0)","v":0},null,{"$f":"MAX(MIN(G23:G24)+G25,0)","v":0},null,{"$f":"MAX(MIN(I23:I24)+I25+I26,0)","v":0}]
[]
[null,"KNEE, FEMUR and PELVIS"]
[null,null,"Left Knee Slide - mm"]
[null,null,"Left Femur Compression level exceeded - kN",null,{"$f":"ROUND(Sliding_Scale(D32,2.6,6.2,4,0),Round)","v":0},null,{"$f":"ROUND(Sliding_Scale(F32,2.6,6.2,4,0),Round)","v":0},null,{"$f":"ROUND(Sliding_Scale(H32,2.6,6.2,4,0),Round)","v":0}]
[null,null,"Incorrect airbag deployment modifier (-1)",null,{"$f":"D33","v":0},null,null,null,{"$f":"H33","v":0}]
[null,"Left Knee, Femur and Pelvis assessment",null,null,{"$f":"MAX(MIN(E32:E32)+E33,0)","v":0},null,{"$f":"MAX(MIN(G31:G32),0)","v":0},null,{"$f":"MAX(MIN(I32:I32)+I33,0)","v":0}]
[null,null,"Right Knee Slide - mm"]
[null,null,"Right Femur Compression level exceeded - kN",null,{"$f":"ROUND(Sliding_Scale(D36,2.6,6.2,4,0),Round)","v":0},null,{"$f":"ROUND(Sliding_Scale(F36,2.6,6.2,4,0),Round)","v":0},null,{"$f":"ROUND(Sliding_Scale(H36,2.6,6.2,4,0),Round)","v":0}]
[null,null,"Incorrect airbag deployment modifier (-1)",null,{"$f":"D37","v":0},null,null,null,{"$f":"H37","v":0}]
[null,"Right Knee, Femur and Pelvis assessment",null,null,{"$f":"MAX(MIN(E36:E36)+E37,0)","v":0},null,{"$f":"MAX(MIN(G35:G36),0)","v":0},null,{"$f":"MAX(MIN(I36:I36)+I37,0)","v":0}]
[]
[null,null,"Submarining modifier (-4)",null,{"$f":"D40","v":0},null,{"$f":"F40","v":0},null,{"$f":"H40","v":0}]
[null,"Pelvis assessment",null,{"$f":"IF(E41=0,\"Green\",IF(E41=-4,\"Red\"))","v":"Green"},{"$f":"E40","v":0},{"$f":"IF(G41=0,\"Green\",IF(G41=-4,\"Red\"))","v":"Green"},{"$f":"G40","v":0},{"$f":"IF(I41=0,\"Green\",IF(I41=-4,\"Red\"))","v":"Green"},{"$f":"I40","v":0}]
[]
[null,"Knee, Femur and Pelvis assessment",null,{"$f":"MAX(MIN(E34,E38)+E41,0)","v":0},null,{"$f":"MAX(MIN(G34,G38)+G41,0)","v":0},null,{"$f":"MAX(MIN(I34,I38)+I41,0)","v":0}]
[]
[null,"LOWER LEG"]
[null,null,"Left compression - kN"]
[null,null,"Left Upper Tibia Index "]
[null,null,"Left Lower Tibia Index"]
[]
[null,null,"Right compression - kN"]
[null,null,"Right Upper Tibia Index "]
[null,null,"Right Lower Tibia Index"]
[]
[null,"SUMMARY"]
[null,null,"Head assessment",{"$f":"D14","v":0},null,{"$f":"F14","v":0},null,{"$f":"H14","v":0}]
[null,null,"Neck assessment",{"$f":"D20","v":0},null,{"$f":"F20","v":0},null,{"$f":"H20","v":0}]
[null,null,"Chest assessment",{"$f":"D28","v":0},null,{"$f":"F28","v":0},null,{"$f":"H28","v":0}]
[null,null,"Knee, Femur and Pelvis assessment",{"$f":"D43","v":0},null,{"$f":"F43","v":0},null,{"$f":"H43","v":0}]
[null,"DUMMY SCORE",null,{"$f":"ROUND(SUM(D55:E58),Round)","v":0},null,{"$f":"ROUND(SUM(F55:G58),Round)","v":0},null,{"$f":"ROUND(SUM(H55:I58),Round)","v":0}]
[]
[null,"Door Opening",null,0]
[null,null,null,{"$f":"IF(OR(D55=0,D56=0,D57=0,F55=0,F57=0,H55=0,H57=0),TRUE,FALSE)","v":true}]
[null,"TOTAL FRONTAL FW",null,{"$f":"IF(OR(D7>=120,D8>=700,D9>=80,D17>=2.7,D18>=2.9,D19>=57,D23>=34,D24>=1,AND(I6=\"Yes\",H8>=700),H9>=80,H23>=34,H24>=1),0,ROUND(MAX(IF(F59<0.9*D59,(0.5*(MIN(D55:G55)+MIN(D56:G56)+MIN(D57:G57)+MIN(D58:G58))+H59)/4*IF('General Overview'!C17=0,2,1)+D61,(D59+H59)/4*IF('General Overview'!C17=0,2,1)+D61),0),Round))","v":0}]
[null,null,null,null,null,"INCLUDE LOGIC IF <90%"]
[]
[]
[]
[]
[null,"DUMMY MEASUREMENTS"]
[null,"Head"]
[null,"Ax","Max"]
[null,null,"Min"]
[null,"Ay","Max"]
[null,null,"Min"]
[null,"Az","Max"]
[null,null,"Min"]
[null,"Neck"]
[null,"Fx","Max"]
[null,null,"Min"]
[null,"Fy","Max"]
[null,null,"Min"]
[null,"Fz","Max"]
[null,null,"Min"]
[null,"Mx","Max"]
[null,null,"Min"]
[null,"My","Max"]
[null,null,"Min"]
[null,"Mz","Max"]
[null,null,"Min"]
[null,"Chest"]
[null,"Ax","Max"]
[null,null,"Min"]
[null,"Ay","Max"]
[null,null,"Min"]
[null,"Az","Max"]
[null,null,"Min"]
[null,"Dchest","Max"]
[null,null,"Min"]
[null,"Pelvis"]
[null,"Ax","Max"]
[null,null,"Min"]
[null,"Ay","Max"]
[null,null,"Min"]
[null,"Az","Max"]
[null,null,"Min"]
[null,"Iliac (left)"]
[null,"Fx","Max"]
[null,null,"Min"]
[null,"My","Max"]
[null,null,"Min"]
[null,"Iliac (right)"]
[null,"Fx","Max"]
[null,null,"Min"]
[null,"My","Max"]
[null,null,"Min"]
[null,"Lumbar Spine"]
[null,"Fx","Max"]
[null,null,"Min"]
[null,"Fz","Max"]
[null,null,"Min"]
[null,"My","Max"]
[null,null,"Min"]
[null,"Femur (left)"]
[null,"Fz","Max"]
[null,null,"Min"]
[null,"Femur (right)"]
[null,"Fz","Max"]
[null,null,"Min"]
[null,"Knee (left)"]
[null,"Dknee","Max"]
[null,null,"Min"]
[null,"Knee (right)"]
[null,"Dknee","Max"]
[null,null,"Min"]
[null,"Upper Tibia (left)"]
[null,"Fx","Max"]
[null,null,"Min"]
[null,"Fz","Max"]
[null,null,"Min"]
[null,"Mx","Max"]
[null,null,"Min"]
[null,"My","Max"]
[null,null,"Min"]
[null,"Upper Tibia (right)"]
[null,"Fx","Max"]
[null,null,"Min"]
[null,"Fz","Max"]
[null,null,"Min"]
[null,"Mx","Max"]
[null,null,"Min"]
[null,"My","Max"]
[null,null,"Min"]
[null,"Lower Tibia (left)"]
[null,"Fx","Max"]
[null,null,"Min"]
[null,"Fy","Max"]
[null,null,"Min"]
[null,"Fz","Max"]
[null,null,"Min"]
[null,"Mx","Max"]
[null,null,"Min"]
[null,"My","Max"]
[null,null,"Min"]
[null,"Lower Tibia (right)"]
[null,"Fx","Max"]
[null,null,"Min"]
[null,"Fy","Max"]
[null,null,"Min"]
[null,"Fz","Max"]
[null,null,"Min"]
[null,"Mx","Max"]
[null,null,"Min"]
[null,"My","Max"]
[null,null,"Min"]
[]
[null,"VEHICLE MEASUREMENTS"]
[null,"Vehicle B-post"]
[null,"Ax","Max"]
[null,null,"Min"]
[null,"Seatbelt"]
[null,"Fseatbelt","Max"]
[null,null,"Min"]
[]
[null,"STATIC MEASURMENTS"]
[null,"Steering wheel"]
[null,null,"Fore/aft displacement - mm",0,{"$f":"IF(D186>0,\"rearward\",IF(D186<0,\"forward\",\"\"))","v":""}]
[null,null,"Vertical displacement - mm",0,{"$f":"IF(D187>0,\"upward\",IF(D187<0,\"downward\",\"\"))","v":""}]
[null,null,"Lateral displacement - mm",0,{"$f":"IF(D188>0,\"left\",IF(D188<0,\"right\",\"\"))","v":""}]
[null,"A-pillar"]
[null,null,"A-Pillar displacement - mm",0]
[null,"Pedals"]
[null,null,"Brake Vertical displacement - mm",0,{"$f":"IF(D192=\"N/A\",\"\",IF(D192>0,\"upward\",IF(D192<0,\"downward\",\"\")))","v":""}]
[null,null,"Clutch Vertical displacement - mm",0,{"$f":"IF(D193=\"N/A\",\"\",IF(D193>0,\"upward\",IF(D193<0,\"downward\",\"\")))","v":""}]
[null,null,"Accel Vertical displacement - mm",0,{"$f":"IF(D194=\"N/A\",\"\",IF(D194>0,\"upward\",IF(D194<0,\"downward\",\"\")))","v":""}]
[null,null,"Brake Horizontal displacement - mm",0,{"$f":"IF(D195=\"N/A\",\"\",IF(D195>0,\"rearward\",IF(D195<0,\"forward\",\"\")))","v":""}]
[null,null,"Clutch Horizontal displacement - mm",0,{"$f":"IF(D196=\"N/A\",\"\",IF(D196>0,\"rearward\",IF(D196<0,\"forward\",\"\")))","v":""}]
[null,null,"Accel Horizontal displacement - mm",0,{"$f":"IF(D197=\"N/A\",\"\",IF(D197>0,\"rearward\",IF(D197<0,\"forward\",\"\")))","v":""}]
[]
[null,"TEST DETAILS"]
[null,"Vehicle"]
[null,null,"VIN number"]
[null,null,"Test weight - kg",0]
[null,"Test"]
[null,null,"Impact speed - km/h",0]
[null,null,"Impact location - mm"]
[null,null,"Vertical",0]
[null,null,"Horizontal",0]

{"sheet":"AOP Side MDB","index":4,"n_rows":159,"n_cols":5,"rows_kept":159,"cut":false,"hidden":false,"merged":[[150,1,150,4],[59,1,59,4],[47,3,47,4],[42,1,42,2],[42,3,42,4],[53,1,53,2],[53,3,53,4],[49,1,49,2],[49,3,49,4],[48,3,48,4],[51,1,51,2],[51,3,51,4],[46,3,46,4],[52,3,52,4],[26,3,26,4],[44,1,44,2],[45,3,45,4],[27,3,27,4],[38,3,38,4],[43,3,43,4],[26,1,26,2],[32,1,32,2],[37,1,37,2],[37,3,37,4],[18,1,18,2],[11,3,11,4],[1,1,2,2],[3,1,3,2],[1,3,2,4],[10,1,10,2],[10,3,10,4]]}
[]
[null,"Side MDB Test",null,"Driver"]
[]
[null,{"$f":"'General Overview'!G6","v":""},null,"Value","Points"]
[null,"HEAD"]
[null,null,"Peak resultant acceleration - g"]
[null,null,"HIC15",null,{"$f":"ROUND(Sliding_Scale(D7,500,700,4,0),Round)","v":0}]
[null,null,"Resultant Acc. 3 msec exeedence - g",null,{"$f":"ROUND(Sliding_Scale(D8,72,80,4,0),Round)","v":0}]
[null,null,"DAMAGE"]
[null,null,"Incorrect airbag deployment modifier (-1)",null,{"$f":"D10","v":0}]
[null,"Head assessment",null,{"$f":"MAX(MIN(E7:E8)+E10,0)","v":0}]
[]
[null,"CHEST"]
[]
[null,null,"Lateral compression - mm"]
[null,null,"Top",null,{"$f":"ROUND(Sliding_Scale(D16,28,50,4,0),Round)","v":0}]
[null,null,"Middle",null,{"$f":"ROUND(Sliding_Scale(D17,28,50,4,0),Round)","v":0}]
[null,null,"Bottom",null,{"$f":"ROUND(Sliding_Scale(D18,28,50,4,0),Round)","v":0}]
[null,"Chest rib assessment",null,null,{"$f":"MIN(E16:E18)","v":0}]
[null,null,"Shoulder Force modifier (-4)",null,{"$f":"IF(D21>=3,-4,0)","v":0}]
[null,null,"Shoulder Fy - kN"]
[null,null,"Viscous Criterion modifier (-4)",null,{"$f":"IF(OR(D23>=1,D24>=1,D25>=1),-4,0)","v":0}]
[null,null," Top rib Viscous Criterion - m/s"]
[null,null,"Middle rib Viscous Criterion - m/s"]
[null,null,"Bottom rib Viscous Criterion - m/s"]
[null,null,"Incorrect airbag deployment modifier (-1)",null,{"$f":"D26","v":0}]
[null,"Chest assessment",null,{"$f":"MAX(MIN(E16:E18)+SUM(E20,E22,E26),0)","v":0}]
[]
[null,"ABDOMEN"]
[null,null,"Lateral compression - mm"]
[null,null,"Top",null,{"$f":"ROUND(Sliding_Scale(D31,47,65,4,0),Round)","v":0}]
[null,null,"Bottom",null,{"$f":"ROUND(Sliding_Scale(D32,47,65,4,0),Round)","v":0}]
[null,"Abdomen rib assessment",null,null,{"$f":"MIN(E31:E32)","v":0}]
[null,null,"Viscous Criterion modifier (-4)",null,{"$f":"IF(OR(D35>=1,D36>=1),-4,0)","v":0}]
[null,null," Top rib Viscous Criterion - m/s"]
[null,null,"Bottom rib Viscous Criterion - m/s"]
[null,null,"Incorrect airbag deployment modifier (-1)",null,{"$f":"D37","v":0}]
[null,"Abdomen assessment",null,{"$f":"MAX(MIN(E31:E32)+SUM(E34,E37),0)","v":0}]
[]
[null,"PELVIS"]
[null,null,"Pubic Symphysis force - kN",null,{"$f":"ROUND(Sliding_Scale(D41,1.7,2.8,4,0),Round)","v":0}]
[null,null,"Incorrect airbag deployment modifier (-1)",null,{"$f":"D42","v":0}]
[null,"Pelvis assessment",null,{"$f":"MAX(E41+E42,0)","v":0}]
[]
[null,"SUMMARY"]
[null,null,"Head assessment",{"$f":"D11","v":0}]
[null,null,"Chest assessment",{"$f":"D27","v":0}]
[null,null,"Abdomen assessment",{"$f":"D38","v":0}]
[null,null,"Pelvis assessment",{"$f":"D43","v":0}]
[null,"DUMMY SCORE",null,{"$f":"SUM(D46:E49)","v":0}]
[]
[null,"Door Opening"]
[null,null,null,{"$f":"IF(OR(D46=0,D47=0,D48=0,D49=0,'COP Dynamic'!E53=0,'COP Dynamic'!G53=0),TRUE,FALSE)","v":true}]
[null,"TOTAL SIDE MDB",null,{"$f":"ROUND(IF(OR(E7=0,E8=0,E16=0,E17=0,E18=0,E31=0,E32=0,E41=0),0,(D50+D52)/16*6),Round)","v":0}]
[]
[]
[]
[]
[]
[null,"DUMMY MEASUREMENTS"]
[null,"Head"]
[null,"Ax","Max"]
[null,null,"Min"]
[null,"Ay","Max"]
[null,null,"Min"]
[null,"Az","Max"]
[null,null,"Min"]
[null,"Neck"]
[null,"Fx","Max"]
[null,null,"Min"]
[null,"Fy","Max"]
[null,null,"Min"]
[null,"Fz","Max"]
[null,null,"Min"]
[null,"Mx","Max"]
[null,null,"Min"]
[null,"My","Max"]
[null,null,"Min"]
[null,"Mz","Max"]
[null,null,"Min"]
[null,"Shoulder"]
[null,"Fx","Max"]
[null,null,"Min"]
[null,"Fy","Max"]
[null,null,"Min"]
[null,"Fz","Max"]
[null,null,"Min"]
[null,"D","Max"]
[null,null,"Min"]
[null,"α","Max"]
[null,null,"Min"]
[null,"Thorax"]
[null,"D01","Max"]
[null,null,"Min"]
[null,"α01","Max"]
[null,null,"Min"]
[null,"D02","Max"]
[null,null,"Min"]
[null,"α02","Max"]
[null,null,"Min"]
[null,"D03","Max"]
[null,null,"Min"]
[null,"α03","Max"]
[null,null,"Min"]
[null,"Abdomen"]
[null,"D01","Max"]
[null,null,"Min"]
[null,"α01","Max"]
[null,null,"Min"]
[null,"D02","Max"]
[null,null,"Min"]
[null,"α02","Max"]
[null,null,"Min"]
[null,"T12"]
[null,"Ax","Max"]
[null,null,"Min"]
[null,"Ay","Max"]
[null,null,"Min"]
[null,"Az","Max"]
[null,null,"Min"]
[null,"Pelvis"]
[null,"Ax","Max"]
[null,null,"Min"]
[null,"Ay","Max"]
[null,null,"Min"]
[null,"Az","Max"]
[null,null,"Min"]
[null,"Fy","Max"]
[null,null,"Min"]
[null,"Femur (left)"]
[null,"Fx","Max"]
[null,null,"Min"]
[null,"Fy","Max"]
[null,null,"Min"]
[null,"Fz","Max"]
[null,"Femur (right)"]
[null,"Fx","Max"]
[null,null,"Min"]
[null,"Fy","Max"]
[null,null,"Min"]
[null,"Fz","Max"]
[]
[null,"VEHICLE MEASUREMENTS"]
[null,"Vehicle B-post"]
[null,"Ay","Max"]
[null,null,"Min"]
[null,"Trolley"]
[null,"Ax","Max"]
[null,null,"Min"]
[]
[null,"TEST DETAILS"]
[null,"Vehicle"]
[null,null,"VIN number"]
[null,null,"Test weight - kg"]
[null,"Test"]
[null,null,"Impact speed - km/h"]
[null,null,"Impact location - mm"]
[null,null,"Vertical"]
[null,null,"Horizontal"]

{"sheet":"AOP Side Pole","index":5,"n_rows":178,"n_cols":9,"rows_kept":178,"cut":false,"hidden":false,"merged":[[48,3,48,4],[51,3,51,4],[43,3,43,4],[44,1,44,2],[45,3,45,4],[46,3,46,4],[47,3,47,4],[49,3,49,4],[42,3,42,4],[1,1,2,2],[3,1,3,2],[11,3,11,4],[1,3,2,4],[11,1,11,2],[37,1,37,2],[37,3,37,4],[42,1,42,2],[18,1,18,2],[12,3,12,4],[26,1,26,2],[26,3,26,4],[32,1,32,2],[27,3,27,4],[38,3,38,4],[169,1,169,4],[78,1,78,4],[71,3,71,6],[72,1,72,2],[70,1,70,2],[72,3,72,6],[68,1,68,2],[70,3,70,6],[49,1,49,2],[68,3,68,8],[51,7,51,8],[51,5,51,6]]}
[]
[null,"Side Pole Test",null,"Driver"]
[]
[null,{"$f":"'General Overview'!G7","v":""},null,"Value","Points"]
[null,"HEAD"]
[null,null,"Direct head contact with pole",null,{"$f":"IF(D6=\"\",0,IF(D6=\"Yes\",0,4))","v":0}]
[null,null,"Peak resultant acceleration - g",null,{"$f":"IF(D7=\"\",0,IF(D7<80,4,0))","v":0}]
[null,null,"HIC15",null,{"$f":"IF(D8=\"\",0,IF(D8<700,4,0))","v":0}]
[null,null,"Resultant Acc. 3 msec exeedence - g"]
[null,null,"DAMAGE"]
[null,null,"Incorrect airbag deployment modifier (-1)",null,{"$f":"D11","v":0}]
[null,"Head assessment",null,{"$f":"MAX(MIN(E6:E8)+E11,0)","v":0}]
[]
[null,"CHEST"]
[null,null,"Lateral compression - mm"]
[null,null,"Top",null,{"$f":"ROUND(Sliding_Scale(D16,28,50,4,0),Round)","v":0}]
[null,null,"Middle",null,{"$f":"ROUND(Sliding_Scale(D17,28,50,4,0),Round)","v":0}]
[null,null,"Bottom",null,{"$f":"ROUND(Sliding_Scale(D18,28,50,4,0),Round)","v":0}]
[null,"Chest rib assessment",null,null,{"$f":"MIN(E16:E18)","v":0}]
[null,null,"Shoulder Force modifier (-4)",null,{"$f":"IF(D21>=3,-4,0)","v":0}]
[null,null,"Shoulder Fy - kN"]
[null,null,"Viscous Criterion modifier (-4)",null,{"$f":"IF(OR(D23>=1,D24>=1,D25>=1),-4,0)","v":0}]
[null,null," Top rib Viscous Criterion - m/s"]
[null,null,"Middle rib Viscous Criterion - m/s"]
[null,null,"Bottom rib Viscous Criterion - m/s"]
[null,null,"Incorrect airbag deployment modifier (-1)",null,{"$f":"D26","v":0}]
[null,"Chest assessment",null,{"$f":"MAX(MIN(E16:E18)+SUM(E20,E22,E26),0)","v":0}]
[]
[null,"ABDOMEN"]
[null,null,"Lateral compression - mm"]
[null,null,"Top",null,{"$f":"ROUND(Sliding_Scale(D31,47,65,4,0),Round)","v":0}]
[null,null,"Bottom",null,{"$f":"ROUND(Sliding_Scale(D32,47,65,4,0),Round)","v":0}]
[null,"Abdomen rib assessment",null,null,{"$f":"MIN(E31:E32)","v":0}]
[null,null,"Viscous Criterion modifier (-4)",null,{"$f":"IF(OR(D35>=1,D36>=1),-4,0)","v":0}]
[null,null," Top rib Viscous Criterion - m/s"]
[null,null,"Bottom rib Viscous Criterion - m/s"]
[null,null,"Incorrect airbag deployment modifier (-1)",null,{"$f":"D37","v":0}]
[null,"Abdomen assessment",null,{"$f":"MAX(MIN(E31:E32)+SUM(E34,E37),0)","v":0}]
[]
[null,"PELVIS"]
[null,null,"Pubic Symphysis force - kN",null,{"$f":"ROUND(Sliding_Scale(D41,1.7,2.8,4,0),Round)","v":0}]
[null,null,"Incorrect airbag deployment modifier (-1)",null,{"$f":"D42","v":0}]
[null,"Pelvis assessment",null,{"$f":"MAX(E41+E42,0)","v":0}]
[]
[null,"SUMMARY"]
[null,null,"Head assessment",{"$f":"D12","v":0}]
[null,null,"Chest assessment",{"$f":"D27","v":0}]
[null,null,"Abdomen assessment",{"$f":"D38","v":0}]
[null,null,"Pelvis assessment",{"$f":"D43","v":0}]
[null,"DUMMY SCORE",null,{"$f":"SUM(D46:E49)","v":0}]
[]
[null,"HPD Assessment",null,"Row 1",null,"Row 2",null,"Row 3"]
[null,null,"H-point"]
[null,null,"H-point(X) - mm"]
[null,null,"H-point(Z) - mm"]
[null,null,"seat travel 5th-50th - mm"]
[null,null,"seat travel 50th-95th - mm"]
[null,null,"rear seat travel - mm"]
[]
[null,null,"XCoG,5th",{"$f":"D54+126-D56","v":126},null,{"$f":"F54+126-F58","v":126},null,{"$f":"H54+126-H58","v":126}]
[null,null,"ZCoG,5th",{"$f":"D55+594","v":594},null,{"$f":"F55+594","v":594},null,{"$f":"H55+594","v":594}]
[null,null,"XCoG,95th",{"$f":"D54+147+D57","v":147},null,{"$f":"F54+147","v":147},null,{"$f":"H54+147","v":147}]
[null,null,"ZCoG,95th",{"$f":"D55+693","v":693},null,{"$f":"F55+693","v":693},null,{"$f":"H55+693","v":693}]
[null,null,"Meets exemption requirements? (3rd row only)"]
[null,null,"HPD modifier (-2/-4)",null,{"$f":"IF(D66=\"OEM data\",0,IF(OR(D66=\"Fail\",D67=\"Fail\",D68=\"Fail\"),-2*IF('General Overview'!C17=0,2,1),0))","v":0},null,{"$f":"IF(F66=\"OEM data\",0,IF(OR(F66=\"Fail\",F67=\"Fail\",F68=\"Fail\"),-2,0))","v":0},null,{"$f":"IF(H66=\"OEM data\",0,IF(H64=\"Yes\",0,IF(OR(H64=\"No\",H66=\"Fail\",H67=\"Fail\",H68=\"Fail\"),-2,0)))","v":0}]
[null,null,"HPD assessment zone coverage"]
[null,null,"seems within HPD no wider than 15mm"]
[null,null,"uninflated areas no larger than 50mm"]
[null,"HPD assessment",null,{"$f":"E65+G65+I65","v":0}]
[]
[null,"Door Opening"]
[null,null,null,{"$f":"IF(OR(D46=0,D47=0,D48=0,D49=0),TRUE,FALSE)","v":true}]
[null,"TOTAL SIDE POLE",null,{"$f":"MAX(ROUND(IF(OR(D6=\"Yes\",E7=0,E8=0,D16>=55,D17>=55,D18>=55,E31=0,E32=0,E41=0),0,(D50+D69+D71)/16*6),Round),0)","v":0}]
[]
[]
[]
[]
[]
[null,"DUMMY MEASUREMENTS"]
[null,"Head"]
[null,"Ax","Max"]
[null,null,"Min"]
[null,"Ay","Max"]
[null,null,"Min"]
[null,"Az","Max"]
[null,null,"Min"]
[null,"Neck"]
[null,"Fx","Max"]
[null,null,"Min"]
[null,"Fy","Max"]
[null,null,"Min"]
[null,"Fz","Max"]
[null,null,"Min"]
[null,"Mx","Max"]
[null,null,"Min"]
[null,"My","Max"]
[null,null,"Min"]
[null,"Mz","Max"]
[null,null,"Min"]
[null,"Shoulder"]
[null,"Fx","Max"]
[null,null,"Min"]
[null,"Fy","Max"]
[null,null,"Min"]
[null,"Fz","Max"]
[null,null,"Min"]
[null,"D","Max"]
[null,null,"Min"]
[null,"α","Max"]
[null,null,"Min"]
[null,"Thorax"]
[null,"D01","Max"]
[null,null,"Min"]
[null,"α01","Max"]
[null,null,"Min"]
[null,"D02","Max"]
[null,null,"Min"]
[null,"α02","Max"]
[null,null,"Min"]
[null,"D03","Max"]
[null,null,"Min"]
[null,"α03","Max"]
[null,null,"Min"]
[null,"Abdomen"]
[null,"D01","Max"]
[null,null,"Min"]
[null,"α01","Max"]
[null,null,"Min"]
[null,"D02","Max"]
[null,null,"Min"]
[null,"α02","Max"]
[null,null,"Min"]
[null,"T12"]
[null,"Ax","Max"]
[null,null,"Min"]
[null,"Ay","Max"]
[null,null,"Min"]
[null,"Az","Max"]
[null,null,"Min"]
[null,"Pelvis"]
[null,"Ax","Max"]
[null,null,"Min"]
[null,"Ay","Max"]
[null,null,"Min"]
[null,"Az","Max"]
[null,null,"Min"]
[null,"Fy","Max"]
[null,null,"Min"]
[null,"Femur (left)"]
[null,"Fx","Max"]
[null,null,"Min"]
[null,"Fy","Max"]
[null,null,"Min"]
[null,"Fz","Max"]
[null,"Femur (right)"]
[null,"Fx","Max"]
[null,null,"Min"]
[null,"Fy","Max"]
[null,null,"Min"]
[null,"Fz","Max"]
[]
[null,"VEHICLE MEASUREMENTS"]
[null,"Vehicle B-post"]
[null,"Ay","Max"]
[null,null,"Min"]
[null,"Trolley"]
[null,"Ax","Max"]
[null,null,"Min"]
[]
[null,"TEST DETAILS"]
[null,"Vehicle"]
[null,null,"VIN number"]
[null,null,"Test weight - kg"]
[null,"Test"]
[null,null,"Impact speed - km/h"]
[null,null,"Impact location - mm"]
[null,null,"Vertical"]
[null,null,"Horizontal"]

{"sheet":"AOP Farside","index":6,"n_rows":70,"n_cols":8,"rows_kept":70,"cut":false,"hidden":false,"merged":[[61,3,61,4],[61,5,61,6],[7,3,7,4],[7,5,7,6],[31,5,31,6],[11,5,11,6],[12,5,12,6],[43,5,43,6],[44,5,44,6],[55,5,55,6],[56,5,56,6],[57,1,57,2],[57,3,57,4],[43,1,43,2],[43,3,43,4],[19,3,19,4],[37,1,37,2],[41,1,41,2],[30,1,30,2],[30,3,30,4],[31,3,31,4],[42,1,42,4],[44,3,44,4],[56,3,56,4],[55,3,55,4],[54,3,54,4],[69,1,69,2],[50,1,50,2],[50,3,50,4],[51,3,51,4],[52,1,52,2],[53,3,53,4],[69,3,69,6],[67,1,67,2],[67,3,67,6],[59,1,59,2],[59,3,59,4],[59,5,59,6],[57,5,57,6],[54,5,54,6],[51,5,51,6],[53,5,53,6],[1,1,2,2],[1,3,2,4],[3,1,3,2],[18,1,18,2],[18,3,18,4],[11,3,11,4],[12,3,12,4],[11,1,11,2],[5,3,5,4],[6,3,6,4],[1,5,2,6],[18,5,18,6],[19,5,19,6],[30,5,30,6],[50,5,50,6],[5,5,5,6],[6,5,6,6]]}
[null,null,null,null,null,null,null,{"$f":"IF(OR(D10=\"No OEM Data\",F10=\"No OEM Data\"),TRUE,FALSE)","v":false}]
[null,"Far Side Tests",null,"AE-MDB",null,"Pole"]
[]
[null,"OEM DATA",null,"Value","Points","Value","Points"]
[null,"PREREQUISITE"]
[null,null,"Structural failure"]
[null,null,"Restraint failure"]
[]
[null,"EXCURSION ZONE"]
[null,null,"Excursion zone"]
[null,null,"Red line >125 mm outboard of the orange line"]
[null,"Excursion zone scaling factor",null,{"$f":"IF('General Overview'!E33=\"Standard\",IF(OR(D10=\"Green\",D10=\"Yellow\"),\"100%\",IF(D10=\"Orange\",\"75%\",IF(D10=\"Red\",IF(D11=\"No\",\"Head & Chest 0 points\",IF(D11=\"Yes\",\"Head 2 points & Chest 0 points\",\"Enter data in D10\")),IF(D10=\"Capping\",\"Both tests capped\",\"No excursion entered\")))),IF(D10=\"Green\",\"100%\",IF(D10=\"Yellow\",\"50%\",IF(D10=\"Orange\",\"25%\",IF(D10=\"Red\",\"25% and Head & Chest 0 points\",IF(D10=\"Capping\",\"Both tests capped\",\"No excursion entered\"))))))","v":"No excursion entered"},null,{"$f":"IF('General Overview'!E33=\"Standard\",IF(OR(F10=\"Green\",F10=\"Yellow\"),\"100%\",IF(F10=\"Orange\",\"75%\",IF(F10=\"Red\",IF(F11=\"No\",\"Head & Chest 0 points\",IF(F11=\"Yes\",\"Head 2 points & Chest 0 points\",\"Enter data in D10\")),IF(F10=\"Capping\",\"Both tests capped\",\"No excursion entered\")))),IF(F10=\"Green\",\"100%\",IF(F10=\"Yellow\",\"50%\",IF(F10=\"Orange\",\"25%\",IF(F10=\"Red\",\"25% and Head & Chest 0 points\",IF(F10=\"Capping\",\"Both tests capped\",\"No excursion entered\"))))))","v":"No excursion entered"}]
[]
[null,"HEAD"]
[null,null,"Hard contact"]
[null,null,"HIC15",null,{"$f":"IF(D15=\"Yes\",Sliding_Scale(D16,500,700,IF('General Overview'!E33=\"Standard\",IF(OR(D10=\"Green\",D10=\"Yellow\"),4,IF(D10=\"Orange\",3,IF(D10=\"Red\",IF(D11=\"No\",0,IF(D11=\"Yes\",2)),IF(D10=\"Capping\",0,0)))),IF(D10=\"Green\",4,IF(D10=\"Yellow\",2,IF(D10=\"Orange\",1,IF(D10=\"Red\",0,IF(D10=\"Capping\",0,0)))))),0),\"\")","v":""},null,{"$f":"IF(F15=\"Yes\",Sliding_Scale(F16,500,700,IF('General Overview'!E33=\"Standard\",IF(OR(F10=\"Green\",F10=\"Yellow\"),4,IF(F10=\"Orange\",3,IF(F10=\"Red\",IF(F11=\"No\",0,IF(F11=\"Yes\",2)),IF(F10=\"Capping\",0,0)))),IF(F10=\"Green\",4,IF(F10=\"Yellow\",2,IF(F10=\"Orange\",1,IF(F10=\"Red\",0,IF(F10=\"Capping\",0,0)))))),0),\"\")","v":""}]
[null,null,"Resultant Acc. 3 msec exeedence - g",null,{"$f":"Sliding_Scale(D17,72,80,IF('General Overview'!E33=\"Standard\",IF(OR(D10=\"Green\",D10=\"Yellow\"),4,IF(D10=\"Orange\",3,IF(D10=\"Red\",IF(D11=\"No\",0,IF(D11=\"Yes\",2)),IF(D10=\"Capping\",0,0)))),IF(D10=\"Green\",4,IF(D10=\"Yellow\",2,IF(D10=\"Orange\",1,IF(D10=\"Red\",0,IF(D10=\"Capping\",0,0)))))),0)","v":0},null,{"$f":"Sliding_Scale(F17,72,80,IF('General Overview'!E33=\"Standard\",IF(OR(F10=\"Green\",F10=\"Yellow\"),4,IF(F10=\"Orange\",3,IF(F10=\"Red\",IF(F11=\"No\",0,IF(F11=\"Yes\",2)),IF(F10=\"Capping\",0,0)))),IF(F10=\"Green\",4,IF(F10=\"Yellow\",2,IF(F10=\"Orange\",1,IF(F10=\"Red\",0,IF(F10=\"Capping\",0,0)))))),0)","v":0}]
[null,null,"DAMAGE"]
[null,"Head assessment",null,{"$f":"MIN(E16:E17)","v":0},null,{"$f":"MIN(G16:G17)","v":0}]
[]
[null,"NECK"]
[null,null,"Tension Fz - kN"]
[null,null,"Upper Neck",null,{"$f":"IF(D23=\"\",0,IF(D23<=3.74,IF('General Overview'!E33=\"Standard\",IF(OR(D10=\"Green\",D10=\"Yellow\"),4,IF(D10=\"Orange\",3,IF(D10=\"Red\",4,IF(D10=\"Capping\",0,0)))),IF(D10=\"Green\",4,IF(D10=\"Yellow\",2,IF(D10=\"Orange\",1,IF(D10=\"Red\",1,IF(D10=\"Capping\",0,0)))))),0))","v":0},null,{"$f":"IF(F23=\"\",0,IF(F23<=3.74,IF('General Overview'!E33=\"Standard\",IF(OR(F10=\"Green\",F10=\"Yellow\"),4,IF(F10=\"Orange\",3,IF(F10=\"Red\",4,IF(F10=\"Capping\",0,0)))),IF(F10=\"Green\",4,IF(F10=\"Yellow\",2,IF(F10=\"Orange\",1,IF(F10=\"Red\",1,IF(F10=\"Capping\",0,0)))))),0))","v":0}]
[null,null,"Lower Neck",null,{"$f":"IF(D24=\"\",0,IF(D24<=3.74,IF('General Overview'!E33=\"Standard\",IF(OR(D10=\"Green\",D10=\"Yellow\"),4,IF(D10=\"Orange\",3,IF(D10=\"Red\",4,IF(D10=\"Capping\",0,0)))),IF(D10=\"Green\",4,IF(D10=\"Yellow\",2,IF(D10=\"Orange\",1,IF(D10=\"Red\",1,IF(D10=\"Capping\",0,0)))))),0))","v":0},null,{"$f":"IF(F24=\"\",0,IF(F24<=3.74,IF('General Overview'!E33=\"Standard\",IF(OR(F10=\"Green\",F10=\"Yellow\"),4,IF(F10=\"Orange\",3,IF(F10=\"Red\",4,IF(F10=\"Capping\",0,0)))),IF(F10=\"Green\",4,IF(F10=\"Yellow\",2,IF(F10=\"Orange\",1,IF(F10=\"Red\",1,IF(F10=\"Capping\",0,0)))))),0))","v":0}]
[null,null,"Lateral Flexion - Nm"]
[null,null,"MxOC",null,{"$f":"Sliding_Scale(D26,162,248,IF('General Overview'!E33=\"Standard\",IF(OR(D10=\"Green\",D10=\"Yellow\"),4,IF(D10=\"Orange\",3,IF(D10=\"Red\",4,IF(D10=\"Capping\",0,0)))),IF(D10=\"Green\",4,IF(D10=\"Yellow\",2,IF(D10=\"Orange\",1,IF(D10=\"Red\",1,IF(D10=\"Capping\",0,0)))))),0)","v":0},null,{"$f":"Sliding_Scale(F26,162,248,IF('General Overview'!E33=\"Standard\",IF(OR(F10=\"Green\",F10=\"Yellow\"),4,IF(F10=\"Orange\",3,IF(F10=\"Red\",4,IF(F10=\"Capping\",0,0)))),IF(F10=\"Green\",4,IF(F10=\"Yellow\",2,IF(F10=\"Orange\",1,IF(F10=\"Red\",1,IF(F10=\"Capping\",0,0)))))),0)","v":0}]
[null,null,"Mx (base of neck)",null,{"$f":"Sliding_Scale(D27,162,248,IF('General Overview'!E33=\"Standard\",IF(OR(D10=\"Green\",D10=\"Yellow\"),4,IF(D10=\"Orange\",3,IF(D10=\"Red\",4,IF(D10=\"Capping\",0,0)))),IF(D10=\"Green\",4,IF(D10=\"Yellow\",2,IF(D10=\"Orange\",1,IF(D10=\"Red\",1,IF(D10=\"Capping\",0,0)))))),0)","v":0},null,{"$f":"Sliding_Scale(F27,162,248,IF('General Overview'!E33=\"Standard\",IF(OR(F10=\"Green\",F10=\"Yellow\"),4,IF(F10=\"Orange\",3,IF(F10=\"Red\",4,IF(F10=\"Capping\",0,0)))),IF(F10=\"Green\",4,IF(F10=\"Yellow\",2,IF(F10=\"Orange\",1,IF(F10=\"Red\",1,IF(F10=\"Capping\",0,0)))))),0)","v":0}]
[null,null,"Extension - Nm"]
[null,null,"MyOC",null,{"$f":"IF(D29=\"\",0,IF(D29<=50,IF('General Overview'!E33=\"Standard\",IF(OR(D10=\"Green\",D10=\"Yellow\"),4,IF(D10=\"Orange\",3,IF(D10=\"Red\",4,IF(D10=\"Capping\",0,0)))),IF(D10=\"Green\",4,IF(D10=\"Yellow\",2,IF(D10=\"Orange\",1,IF(D10=\"Red\",1,IF(D10=\"Capping\",0,0)))))),0))","v":0},null,{"$f":"IF(F29=\"\",0,IF(F29<=50,IF('General Overview'!E33=\"Standard\",IF(OR(F10=\"Green\",F10=\"Yellow\"),4,IF(F10=\"Orange\",3,IF(F10=\"Red\",4,IF(F10=\"Capping\",0,0)))),IF(F10=\"Green\",4,IF(F10=\"Yellow\",2,IF(F10=\"Orange\",1,IF(F10=\"Red\",1,IF(F10=\"Capping\",0,0)))))),0))","v":0}]
[null,null,"My (base of neck)"]
[null,"Neck assessment",null,{"$f":"MIN(E23:E30)","v":0},null,{"$f":"MIN(G23:G30)","v":0}]
[]
[null,"CHEST & ABDOMEN"]
[null,null,"Lateral compression - mm"]
[null,null,"Top",null,{"$f":"ROUND(Sliding_Scale(D35,28,50,IF('General Overview'!E33=\"Standard\",IF(OR(D10=\"Green\",D10=\"Yellow\"),4,IF(D10=\"Orange\",3,IF(D10=\"Red\",0,IF(D10=\"Capping\",0,0)))),IF(D10=\"Green\",4,IF(D10=\"Yellow\",2,IF(D10=\"Orange\",1,IF(D10=\"Red\",0,IF(D10=\"Capping\",0,0)))))),0),Round)","v":0},null,{"$f":"ROUND(Sliding_Scale(F35,28,50,IF('General Overview'!E33=\"Standard\",IF(OR(F10=\"Green\",F10=\"Yellow\"),4,IF(F10=\"Orange\",3,IF(F10=\"Red\",0,IF(F10=\"Capping\",0,0)))),IF(F10=\"Green\",4,IF(F10=\"Yellow\",2,IF(F10=\"Orange\",1,IF(F10=\"Red\",0,IF(F10=\"Capping\",0,0)))))),0),Round)","v":0}]
[null,null,"Middle",null,{"$f":"ROUND(Sliding_Scale(D36,28,50,IF('General Overview'!E33=\"Standard\",IF(OR(D10=\"Green\",D10=\"Yellow\"),4,IF(D10=\"Orange\",3,IF(D10=\"Red\",0,IF(D10=\"Capping\",0,0)))),IF(D10=\"Green\",4,IF(D10=\"Yellow\",2,IF(D10=\"Orange\",1,IF(D10=\"Red\",0,IF(D10=\"Capping\",0,0)))))),0),Round)","v":0},null,{"$f":"ROUND(Sliding_Scale(F36,28,50,IF('General Overview'!E33=\"Standard\",IF(OR(F10=\"Green\",F10=\"Yellow\"),4,IF(F10=\"Orange\",3,IF(F10=\"Red\",0,IF(F10=\"Capping\",0,0)))),IF(F10=\"Green\",4,IF(F10=\"Yellow\",2,IF(F10=\"Orange\",1,IF(F10=\"Red\",0,IF(F10=\"Capping\",0,0)))))),0),Round)","v":0}]
[null,null,"Bottom",null,{"$f":"ROUND(Sliding_Scale(D37,28,50,IF('General Overview'!E33=\"Standard\",IF(OR(D10=\"Green\",D10=\"Yellow\"),4,IF(D10=\"Orange\",3,IF(D10=\"Red\",0,IF(D10=\"Capping\",0,0)))),IF(D10=\"Green\",4,IF(D10=\"Yellow\",2,IF(D10=\"Orange\",1,IF(D10=\"Red\",0,IF(D10=\"Capping\",0,0)))))),0),Round)","v":0},null,{"$f":"ROUND(Sliding_Scale(F37,28,50,IF('General Overview'!E33=\"Standard\",IF(OR(F10=\"Green\",F10=\"Yellow\"),4,IF(F10=\"Orange\",3,IF(F10=\"Red\",0,IF(F10=\"Capping\",0,0)))),IF(F10=\"Green\",4,IF(F10=\"Yellow\",2,IF(F10=\"Orange\",1,IF(F10=\"Red\",0,IF(F10=\"Capping\",0,0)))))),0),Round)","v":0}]
[null,"Chest rib assessment",null,null,{"$f":"MIN(E35:E37)","v":0},null,{"$f":"MIN(G35:G37)","v":0}]
[null,null,"Lateral compression - mm"]
[null,null,"Top",null,{"$f":"ROUND(Sliding_Scale(D40,47,65,IF('General Overview'!E33=\"Standard\",IF(OR(D10=\"Green\",D10=\"Yellow\"),4,IF(D10=\"Orange\",3,IF(D10=\"Red\",0,IF(D10=\"Capping\",0,0)))),IF(D10=\"Green\",4,IF(D10=\"Yellow\",2,IF(D10=\"Orange\",1,IF(D10=\"Red\",0,IF(D10=\"Capping\",0,0)))))),0),Round)","v":0},null,{"$f":"ROUND(Sliding_Scale(F40,47,65,IF('General Overview'!E33=\"Standard\",IF(OR(F10=\"Green\",F10=\"Yellow\"),4,IF(F10=\"Orange\",3,IF(F10=\"Red\",0,IF(F10=\"Capping\",0,0)))),IF(F10=\"Green\",4,IF(F10=\"Yellow\",2,IF(F10=\"Orange\",1,IF(F10=\"Red\",0,IF(F10=\"Capping\",0,0)))))),0),Round)","v":0}]
[null,null,"Bottom",null,{"$f":"ROUND(Sliding_Scale(D41,47,65,IF('General Overview'!E33=\"Standard\",IF(OR(D10=\"Green\",D10=\"Yellow\"),4,IF(D10=\"Orange\",3,IF(D10=\"Red\",0,IF(D10=\"Capping\",0,0)))),IF(D10=\"Green\",4,IF(D10=\"Yellow\",2,IF(D10=\"Orange\",1,IF(D10=\"Red\",0,IF(D10=\"Capping\",0,0)))))),0),Round)","v":0},null,{"$f":"ROUND(Sliding_Scale(F41,47,65,IF('General Overview'!E33=\"Standard\",IF(OR(F10=\"Green\",F10=\"Yellow\"),4,IF(F10=\"Orange\",3,IF(F10=\"Red\",0,IF(F10=\"Capping\",0,0)))),IF(F10=\"Green\",4,IF(F10=\"Yellow\",2,IF(F10=\"Orange\",1,IF(F10=\"Red\",0,IF(F10=\"Capping\",0,0)))))),0),Round)","v":0}]
[null,"Abdomen rib assessment",null,null,{"$f":"MIN(E40:E41)","v":0},null,{"$f":"MIN(G40:G41)","v":0}]
[]
[null,"Chest & Abdomen assessment",null,{"$f":"MIN(E38,E42)","v":0},null,{"$f":"MIN(G38,G42)","v":0}]
[]
[null,"PELVIS"]
[null,null,"Pubic Symphysis force - kN",null,{"$f":"IF(D47>2.8,-4,0)","v":0},null,{"$f":"IF(F47>2.8,-4,0)","v":0}]
[null,null,"Lumbar Fy - kN",null,{"$f":"IF(D48>2,-4,0)","v":0},null,{"$f":"IF(F48>2,-4,0)","v":0}]
[null,null,"Lumbar Fz - kN",null,{"$f":"IF(D49>3.5,-4,0)","v":0},null,{"$f":"IF(F49>3.5,-4,0)","v":0}]
[null,null,"Lumbar Mx - Nm",null,{"$f":"IF(D50>120,-4,0)","v":0},null,{"$f":"IF(F50>120,-4,0)","v":0}]
[null,"Pelvis assessment",null,{"$f":"IF(COUNTIF(E47:E50,-4)>0,-4,0)","v":0},null,{"$f":"IF(COUNTIF(G47:G50,-4)>0,-4,0)","v":0}]
[]
[null,"SUMMARY"]
[null,null,"Head assessment",{"$f":"D19","v":0},null,{"$f":"F19","v":0}]
[null,null,"Neck assessment",{"$f":"D31","v":0},null,{"$f":"F31","v":0}]
[null,null,"Chest & Abdomen assessment",{"$f":"D44","v":0},null,{"$f":"F44","v":0}]
[null,null,"Pelvis assessment",{"$f":"D51","v":0},null,{"$f":"F51","v":0}]
[null,"DUMMY SCORE",null,{"$f":"SUM(D54:E57)","v":0},null,{"$f":"SUM(F54:G57)","v":0}]
[]
[null,"TEST SCORE",null,{"$f":"IF(OR(D10=\"Capping\",F10=\"Capping\"),0,IF(OR(D16>700,D17>80,D35>50,D36>50,D37>50,D40>65,D41>65),0,MAX(SUM(D54:E57),0)))/12*2","v":0},null,{"$f":"IF(OR(D10=\"Capping\",F10=\"Capping\"),0,IF(OR(F16>700,F17>80,F35>50,F36>50,F37>50,F40>65,F41>65),0,MAX(SUM(F54:G57),0)))/12*2","v":0}]
[]
[null,"OCCUPANT-TO-OCCUPANT",null,"DRIVER",null,"PASSENGER"]
[null,null,"Head-to-Head contact (from video)",null,{"$f":"IF(D63=\"Yes\",-1,0)","v":0},null,{"$f":"IF(F63=\"Yes\",-1,0)","v":0}]
[null,null,"HIC15",null,{"$f":"IF(D64>700,-1,0)","v":0},null,{"$f":"IF(F64>700,-1,0)","v":0}]
[null,null,"Resultant Acc. 3 msec exeedence - g",null,{"$f":"IF(D65>80,-1,0)","v":0},null,{"$f":"IF(F65>80,-1,0)","v":0}]
[null,null,"Symmetrical performance",null,{"$f":"IF(D66=\"FAIL\",-1,0)","v":0},null,{"$f":"IF(F66=\"FAIL\",-1,0)","v":0}]
[null,null,"Protection Zone",null,{"$f":"IF(D67=\"FAIL\",-1,0)","v":0},null,{"$f":"IF(F67=\"FAIL\",-1,0)","v":0}]
[null,"Occupant-to-Occupant Head Contact Assessment",null,{"$f":"MIN(E63:E67,G63:G67)","v":0}]
[]
[null,"TOTAL FARSIDE",null,{"$f":"IF(COUNTIF(D6:G7,\"Yes\")>0,0,MAX(ROUND((D60+F60)+D68,Round),0))","v":0}]

{"sheet":"AOP Whiplash","index":7,"n_rows":155,"n_cols":7,"rows_kept":155,"cut":false,"hidden":false,"merged":[[73,3,73,6],[63,3,63,4],[63,5,63,6],[58,3,58,4],[59,3,59,4],[60,3,60,4],[61,3,61,4],[62,3,62,4],[35,6,36,6],[68,3,68,6],[69,3,69,6],[70,3,70,6],[72,3,72,6],[56,3,56,4],[65,3,65,6],[61,5,61,6],[62,5,62,6],[58,5,58,6],[56,5,56,6],[57,5,57,6],[59,5,59,6],[60,5,60,6],[1,1,2,2],[1,3,2,4],[1,5,2,6],[3,1,3,2],[5,3,5,6],[6,3,6,6],[75,1,75,2],[151,1,151,6],[39,1,39,2],[39,3,39,4],[39,5,39,6],[48,3,48,4],[48,5,48,6],[72,1,72,2],[73,1,73,2],[65,1,65,2],[67,1,67,2],[67,3,67,6],[63,1,63,2],[75,3,75,6],[35,4,36,4],[55,1,55,2],[48,1,48,2],[40,3,40,4],[40,5,40,6],[55,3,55,4],[55,5,55,6],[12,1,12,2],[20,1,20,2],[22,1,22,2],[12,3,12,6],[20,3,20,6],[22,3,22,6]]}
[]
[null,"Whiplash Tests",null,"Mid Pulse",null,"High Pulse"]
[]
[null,{"$f":"'General Overview'!G9","v":""},null,"Value","Points","Value","Points"]
[null,"SEAT SPECIFICATION"]
[null,null,"Type of headrest"]
[null,null,"Type of seat"]
[]
[null,"STATIC"]
[null,null,"Test position"]
[null,null,"Effective Height  - mm",null,{"$f":"ROUND(Sliding_Scale(D11,755,825,-1,1),Round)","v":0},null,{"$f":"ROUND(Sliding_Scale(F11,755,825,-1,1),Round)","v":0}]
[null,null,"Backset - mm",null,{"$f":"IF(D12=\"\",0,IF(D12<45,1,-1))","v":0},null,{"$f":"IF(F12=\"\",0,IF(F12<45,1,-1))","v":0}]
[null,"Geometric assessment (test position)",null,{"$f":"MIN(AVERAGE(E11,G11),AVERAGE(E12,G12))","v":0}]
[]
[null,null,"Down/Back"]
[null,null,"Effective Height  - mm",null,{"$f":"IF(D16=\"\",\"FAIL\",IF(D16>790,\"PASS\",\"FAIL\"))","v":"FAIL"},null,{"$f":"IF(F16=\"\",\"FAIL\",IF(F16>790,\"PASS\",\"FAIL\"))","v":"FAIL"}]
[null,null,"Backset - mm",null,{"$f":"IF(D17=\"\",\"FAIL\",IF(D17<70,\"PASS\",\"FAIL\"))","v":"FAIL"},null,{"$f":"IF(F17=\"\",\"FAIL\",IF(F17<70,\"PASS\",\"FAIL\"))","v":"FAIL"}]
[]
[null,null,"Passenger Effective Height  - mm",null,{"$f":"IF(D19=\"\",\"FAIL\",IF(D19>790,\"PASS\",\"FAIL\"))","v":"FAIL"},null,{"$f":"IF(F19=\"\",\"FAIL\",IF(F19>790,\"PASS\",\"FAIL\"))","v":"FAIL"}]
[null,null,"Passenger Backset - mm",null,{"$f":"IF(D20=\"\",\"FAIL\",IF(D20<70,\"PASS\",\"FAIL\"))","v":"FAIL"},null,{"$f":"IF(F20=\"\",\"FAIL\",IF(F20<70,\"PASS\",\"FAIL\"))","v":"FAIL"}]
[null,"Ease of Adjustment",null,{"$f":"IF(D70>3,IF(COUNTIF((D16:G17),\"FAIL\")>0,0,0.5)+IF(COUNTIF((D19:G20),\"FAIL\")>0,0,0.5),0)","v":0}]
[]
[null,"Static assessment",null,{"$f":"SUM(D13,D21)","v":0}]
[]
[null,"DYNAMIC"]
[null,null,"NIC max - m2/s2",null,{"$f":"IF(D26>27,\"Test Capped\",ROUND(Sliding_Scale(D26,11,24,1,0),Round))","v":0},null,{"$f":"IF(F26>25.5,\"Test Capped\",ROUND(Sliding_Scale(F26,13,23,1,0),Round))","v":0}]
[null,null,"UPPER Neck Shear (+Fx) - N",null,{"$f":"IF(D27>290,\"Test Capped\",ROUND(Sliding_Scale(D27,30,190,1,0),Round))","v":0},null,{"$f":"IF(F27>364,\"Test Capped\",ROUND(Sliding_Scale(F27,30,210,1,0),Round))","v":0}]
[null,null,"UPPER Neck Tension (+Fz) - N",null,{"$f":"IF(D28>900,\"Test Capped\",ROUND(Sliding_Scale(D28,360,750,1,0),Round))","v":0},null,{"$f":"IF(F28>1024,\"Test Capped\",ROUND(Sliding_Scale(F28,470,770,1,0),Round))","v":0}]
[]
[null,null,"Nkm ",null,{"$f":"IF(D30>0.69,\"Test Capped\",\"\" )","v":""},null,{"$f":"IF(F30>0.78,\"Test Capped\",\"\" )","v":""}]
[null,null,"Rebound velocity - m/s",null,{"$f":"IF(D31>5.2,\"Test Capped\",\"\" )","v":""},null,{"$f":"IF(F31>6,\"Test Capped\",\"\" )","v":""}]
[null,null,"UPPER Neck Shear (-Fx) - N",null,{"$f":"IF(D32>360,\"Test Capped\",\"\" )","v":""},null,{"$f":"IF(F32>360,\"Test Capped\",\"\" )","v":""}]
[null,null,"UPPER Neck Extension & Flexion (My) - Nm",null,{"$f":"IF(D33>30,\"Test Capped\",\"\" )","v":""},null,{"$f":"IF(F33>30,\"Test Capped\",\"\" )","v":""}]
[null,null,"LOWER Neck Shear (ABS(Fx)) - N",null,{"$f":"IF(D34>360,\"Test Capped\",\"\" )","v":""},null,{"$f":"IF(F34>360,\"Test Capped\",\"\" )","v":""}]
[null,null,"LOWER Neck Extension & Flexion (My) - N",null,{"$f":"IF(D35>30,\"Test Capped\",\"\" )","v":""},null,{"$f":"IF(F35>30,\"Test Capped\",\"\" )","v":""}]
[null,null,"T1 x-acc - g",null,{"$f":"IF(AND(D36>15.55,D37>92),\"Test Capped\",\"\" )","v":""},null,{"$f":"IF(AND(F36>17.8,F37>92),\"Test Capped\",\"\" )","v":""}]
[null,null,"Head contact start - ms"]
[]
[null,null,"Max Seat Back Dynamic Deflection - degree",null,null,null,{"$f":"IF(F39>32,\"Test Capped\",\"\" )","v":""}]
[null,"Dynamic assessment",null,{"$f":"IF(COUNTIF(E26:E39,\"Test Capped\")>0,0,SUM(E26:E28))","v":0},null,{"$f":"IF(COUNTIF(G26:G39,\"Test Capped\")>0,0,SUM(G26:G28))","v":0}]
[]
[null,"REAR WHIPLASH",null,{"$f":"IF('General Overview'!C17=0,\"\",\"2ND ROW\")","v":""},null,{"$f":"IF('General Overview'!C18=0,\"\",\"3RD ROW\")","v":""}]
[null,null,"Head restraint fitted to all positions"]
[null,null,"Compliant with R17-08"]
[null,null,"Effective Height"]
[null,null,"Lowest position - mm",null,{"$f":"IF(D46>720,\"PASS\",\"FAIL\")","v":"FAIL"},null,{"$f":"IF(F42=\"\",\"\",IF(F46>720,\"PASS\",\"FAIL\"))","v":""}]
[null,null,"Highest position - mm",null,{"$f":"IF(D47>770,\"PASS\",\"FAIL\")","v":"FAIL"},null,{"$f":"IF(F42=\"\",\"\",IF(F47>770,\"PASS\",\"FAIL\"))","v":""}]
[null,null,{"$f":"IF(OR(E47=\"Fail\",G47=\"Fail\"),\"<50mm from interior\",\"\")","v":"<50mm from interior"}]
[null,"Rear Effective Height assessment",null,{"$f":"(IF(OR(AND(E46=\"PASS\",E47=\"PASS\"),D48=\"Yes\"),1.5,0))","v":0},null,{"$f":"IF(OR(AND(G46=\"PASS\",G47=\"PASS\"),F48=\"Yes\"),1.5,0)","v":0}]
[]
[null,null,"Backset requirements"]
[null,null,"Torso angle - deg"]
[null,null,"(ΔCP X) mid position- mm",null,{"$f":"IF(D53=\"\",0,IF(AND(E46=\"Pass\",OR(E47=\"Pass\",D48=\"Yes\"),D53<=(7.128*D52+153)),1,0))","v":0},null,{"$f":"IF(F53=\"\",0,IF(AND(G46=\"Pass\",OR(G47=\"Pass\",F48=\"Yes\"),F53<=(7.128*F52+153)),1,0))","v":0}]
[null,null,"(ΔCP X) worst case position- mm",null,{"$f":"IF(D54=\"\",0,IF(AND(E46=\"Pass\",OR(E47=\"Pass\",D48=\"Yes\"),D54<=(7.128*D52+153)),0.5,0))","v":0},null,{"$f":"IF(F54=\"\",0,IF(AND(G46=\"Pass\",OR(G47=\"Pass\",F48=\"Yes\"),F54<=(7.128*F52+153)),0.5,0))","v":0}]
[]
[null,"Rear Backset Assessment",null,{"$f":"SUM(E53,E54)","v":0},null,{"$f":"SUM(G53,G54)","v":0}]
[]
[null,null,"Non-Use position",{"$f":"IF(OR(AND(E46=\"PASS\",E47=\"PASS\"),D48=\"Yes\",E53>0,E54>0),\"Eligible for scoring\",\"Not eligible for scoring\")","v":"Not eligible for scoring"},null,{"$f":"IF(OR(AND(G46=\"PASS\",G47=\"PASS\"),F48=\"Yes\",G53>0,G54>0),\"Eligible for scoring\",\"Not eligible for scoring\")","v":"Not eligible for scoring"}]
[null,null,"Automatic return head restraints"]
[null,null,"60° rotation evaluation"]
[null,null,"10° torso line change"]
[null,null,"Discomfort metric",null,null,"Pass"]
[]
[null,"Rear Non-Use Position Assessment",null,{"$f":"(IF(AND(D58=\"Eligible for scoring\",OR(COUNTIF(D59:D62,\"Pass\")>0,COUNTIF(D59:D62,\"Not applicable\")=4)),1,0))","v":0},null,{"$f":"(IF(AND(F58=\"Eligible for scoring\",OR(COUNTIF(F59:F62,\"Pass\")>0,COUNTIF(F59:F62,\"Not applicable\")=4)),1,0))","v":0}]
[]
[null,"Rear Whiplash assessment",null,{"$f":"IF(OR(D44=\"No\",F44=\"No\"),0,SUM(D49,D56,D64,F49,F56,F64))/IF(F42=\"\",1,2)","v":0}]
[]
[null,"SUMMARY"]
[null,null,"Static assessment",{"$f":"D23","v":0}]
[null,null,"Dynamic assessment",{"$f":"SUM(D40:G40)","v":0}]
[null,null,"Dummy Artifact Loading (-2)",0]
[]
[null,"TOTAL FRONT WHIPLASH",null,{"$f":"ROUND(SUM(D69:G71)/8*3,Round)","v":0}]
[null,"TOTAL REAR WHIPLASH",null,{"$f":"ROUND(D66/4*1,Round)","v":0}]
[]
[null,"TOTAL WHIPLASH",null,{"$f":"IF(OR('General Overview'!C17=\"\",'General Overview'!C18=\"\",'General Overview'!C17>0,'General Overview'!C18>0),SUM(D73:G74),D73/3*4)","v":0}]
[]
[]
[]
[]
[]
[null,"DUMMY MEASUREMENTS"]
[null,"Head"]
[null,"Ax","Max"]
[null,null,"Min"]
[null,"Ay","Max"]
[null,null,"Min"]
[null,"Az","Max"]
[null,null,"Min"]
[null,"Vx","Max"]
[null,"HRCT","Start"]
[null,null,"End"]
[null,"Cervical Spine"]
[null,"Ax","Max"]
[null,null,"Min"]
[null,"Az","Max"]
[null,null,"Min"]
[null,"Neck Upper"]
[null,"Fx","Max"]
[null,null,"Min"]
[null,"Fy","Max"]
[null,null,"Min"]
[null,"Fz","Max"]
[null,null,"Min"]
[null,"Mx","Max"]
[null,null,"Min"]
[null,"My","Max"]
[null,null,"Min"]
[null,"Mz","Max"]
[null,null,"Min"]
[null,"Neck Lower"]
[null,"Fx","Max"]
[null,null,"Min"]
[null,"Fy","Max"]
[null,null,"Min"]
[null,"Fz","Max"]
[null,null,"Min"]
[null,"Mx","Max"]
[null,null,"Min"]
[null,"My","Max"]
[null,null,"Min"]
[null,"Mz","Max"]
[null,null,"Min"]
[null,"Thoracic Spine (left)"]
[null,"Ax","Max"]
[null,null,"Min"]
[null,"Az","Max"]
[null,null,"Min"]
[null,"Thoracic Spine (right)"]
[null,"Ax","Max"]
[null,null,"Min"]
[null,"Az","Max"]
[null,null,"Min"]
[null,"Thoracic Spine T8"]
[null,"Ax","Max"]
[null,null,"Min"]
[null,"Az","Max"]
[null,null,"Min"]
[null,"Lumbar Spine"]
[null,"Ax","Max"]
[null,null,"Min"]
[null,"Az","Max"]
[null,null,"Min"]
[null,"Pelvis"]
[null,"Ax","Max"]
[null,null,"Min"]
[null,"Ay","Max"]
[null,null,"Min"]
[null,"Az","Max"]
[null,null,"Min"]
[]
[null,"SLED MEASUREMENTS"]
[null,"Sled"]
[null,"Ax","Max"]
[null,null,"Min"]

{"sheet":"AOP Rescue","index":8,"n_rows":74,"n_cols":34,"rows_kept":74,"cut":false,"hidden":false,"merged":[[1,3,3,10],[39,3,39,10],[40,3,40,10],[41,7,41,10],[42,7,42,10],[16,3,16,10],[21,3,21,10],[26,3,26,10],[11,7,11,8],[11,9,11,10],[4,3,4,6],[5,3,5,6],[6,3,6,6],[7,3,7,6],[11,5,11,6],[11,3,11,4],[68,3,68,10],[69,3,69,10],[70,3,70,10],[71,3,71,10],[73,3,73,10],[31,1,31,2],[59,3,59,10],[66,3,66,10],[61,3,61,6],[62,3,62,6],[63,3,63,6],[60,3,60,6],[60,7,63,10],[44,3,44,10],[41,3,41,6],[42,3,42,6],[31,3,31,10],[37,3,37,10],[32,1,32,10],[33,3,33,10],[35,3,35,10],[9,3,9,10],[4,7,4,10],[5,7,5,10],[6,7,6,10],[7,7,7,10],[8,3,8,10],[1,1,2,2],[3,1,3,2],[9,1,9,2],[66,1,66,2],[73,1,73,2],[37,1,37,2],[68,1,68,2],[16,1,16,2],[21,1,21,2],[26,1,26,2],[44,1,44,2],[52,1,52,2],[57,1,57,2],[64,1,64,2],[33,1,33,2],[35,1,35,2],[43,7,43,10],[43,3,43,6],[52,3,52,10],[47,3,47,6],[48,3,48,6],[49,3,49,6],[50,3,50,6],[51,3,51,6],[47,7,47,10],[48,7,48,10],[49,7,49,10],[50,7,50,10],[51,7,51,10],[65,3,65,10],[45,3,45,10],[46,3,46,10],[64,3,64,10],[57,3,57,10],[55,3,55,6],[56,3,56,6],[55,7,55,10],[56,7,56,10],[58,3,58,10]]}
[]
[null,"Rescue, Extrication & Safety"]
[]
[null,{"$f":"'General Overview'!G15","v":""}]
[null,"RESCUE",null,"AVAILABILITY",null,null,null,"COMPLIANCE"]
[null,null,"ISO Compliant Rescue sheet"]
[null,null,"Availble for Model tested - All EAA languages"]
[null,null,"Available for all other cars from OEM (launched 2020 onwards)"]
[null,null,"Emergency Response Guide for tested variant"]
[null,"RESCUE ASSESSMENT",null,{"$f":"IF(COUNTIF(D7:K8,\"FAIL\")>0,-2,IF(D9=\"Fail\",-1,0))","v":0}]
[]
[null,"EXTRICATION",null,"MPDB",null,"FW",null,"AE-MDB",null,"POLE"]
[null,null,null,"Driver side","Passenger side","Driver side","Passenger side","Driver side","Passenger side","Driver side","Passenger side"]
[null,null,"Automatic Door Locking (if applicable)"]
[null,null,"Front",null,null,null,null,0,null,0,null,null,null,null,null,null,null,null,null,null,null,null,null,null,null,null,{"$f":"IF(D15=\"\",\"\",D15)","v":""},{"$f":"IF(E15=\"\",\"\",E15)","v":""},"","","PASS","","PASS",""]
[null,null,"Rear",null,null,null,null,0,null,0,null,null,null,null,null,null,null,null,null,null,null,null,null,null,null,null,{"$f":"IF(D16=\"\",\"\",D16)","v":""},"","","","PASS","","PASS",""]
[null,"Automatic door locking assessment",null,{"$f":"IF(OR(AutoDoorLockRange=\"\",AutoDoorLockRange=\"Fail\"),-1,0)","v":-1}]
[null,null,null,"Driver side","Passenger side","Driver side","Passenger side","Driver side","Passenger side","Driver side","Passenger side"]
[null,null,"Door opening forces - N"]
[null,null,"Front",null,null,null,null,null,null,null,null,null,null,null,null,null,null,null,null,null,null,null,null,null,null,null,{"$f":"IF(D20=\"\",\"\",D20)","v":""},{"$f":"IF(E20=\"\",\"\",E20)","v":""},{"$f":"IF(F20=\"\",\"\",F20)","v":""},{"$f":"IF(G20=\"\",\"\",G20)","v":""},"PASS",{"$f":"IF(I20=\"\",\"\",I20)","v":""},"PASS",{"$f":"IF(K20=\"\",\"\",K20)","v":""}]
[null,null,"Rear",null,null,null,null,null,null,null,null,null,null,null,null,null,null,null,null,null,null,null,null,null,null,null,{"$f":"IF(D21=\"\",\"\",D21)","v":""},"","","","PASS","","PASS",""]
[null,"Door opening force assessment",null,{"$f":"IF(OR(DoorForcesRange=\"\",DoorForcesRange=\"Tools\",DoorForcesRange>750),-1,0)","v":-1}]
[null,null,null,"Driver side","Passenger side","Driver side","Passenger side","Driver side","Passenger side","Driver side","Passenger side"]
[null,null,"Retracting door handles (if applicable)"]
[null,null,"Front",null,null,null,null,null,null,null,null,null,null,null,null,null,null,null,null,null,null,null,null,null,null,null,{"$f":"IF(D25=\"\",\"\",D25)","v":""},{"$f":"IF(E25=\"\",\"\",E25)","v":""},"","","PASS","","PASS",""]
[null,null,"Rear",null,null,null,null,null,null,null,null,null,null,null,null,null,null,null,null,null,null,null,null,null,null,null,{"$f":"IF(D26=\"\",\"\",D26)","v":""},"","","","PASS","","PASS",""]
[null,"Retracting door handles assessment",null,{"$f":"IF(OR(OR(RetractHandlesRange=\"\"),OR(RetractHandlesRange=\"Fail\")),-1,0)","v":-1}]
[null,null,null,"Driver side","Passenger side","Driver side","Passenger side","Driver side","Passenger side","Driver side","Passenger side"]
[null,null,"Seatbelt buckle unlatching - N"]
[null,null,"Front",null,null,null,null,null,null,null,null,null,null,null,null,null,null,null,null,null,null,null,null,null,null,null,{"$f":"IF(D30=\"\",\"\",VALUE(D30))","v":""},{"$f":"IF(E30=\"\",\"\",VALUE(E30))","v":""},"",1,"",1,"",1]
[null,null,"Rear",null,null,null,null,null,null,null,null,null,null,null,null,null,null,null,null,null,null,null,null,null,null,null,{"$f":"IF(D31=\"\",\"\",VALUE(D31))","v":""},{"$f":"IF(E31=\"\",\"\",VALUE(E31))","v":""},1,{"$f":"IF(G31=\"\",\"\",VALUE(G31))","v":""},{"$f":"IF(H31=\"\",\"\",VALUE(H31))","v":""},{"$f":"IF(I31=\"\",\"\",VALUE(I31))","v":""},1,1]
[null,"Seatbelt buckle unlatching assessment",null,{"$f":"IF(NOT(AND(AND(FrontBeltUnlatchingRange<=60),AND(SideBeltUnlatchingRange<=100))),-1,0)","v":-1}]
[]
[null,"Compliance with ECE regulations re EV safety"]
[]
[null,"Identification of Direct Hazard Disabling Equipment"]
[]
[null,"EXTRICATION ASSESSMENT",null,{"$f":"IF(OR(D34=\"Fail\",D36=\"Fail\"),-1,MIN(D17,D22,D27,D32))","v":-1}]
[]
[null,"POST-CRASH TECHNOLOGY"]
[null,null,"Advanced eCall"]
[null,null,"Potential # of occupants",null,null,null,null,{"$f":"IF(D42=\"PASS\",0.5,0)","v":0}]
[null,null,"Recent vehicle locations N1 & N2",null,null,null,null,{"$f":"IF(D43=\"PASS\",0.5,0)","v":0}]
[null,null,"Direction of impact & Delta V"]
[null,"Advanced eCall assessment",null,{"$f":"SUM(H42:K43)","v":0}]
[]
[null,null,"Third Party Service eCall"]
[null,null,"Multi-language communication",null,null,null,null,{"$f":"IF(D48=\"PASS\",0.5,0)","v":0}]
[null,null,"Hazard detection ",null,null,null,null,{"$f":"IF(D49=\"PASS\",0.5,0)","v":0}]
[null,null,"Transfer of paired mobile number",null,null,null,null,0]
[null,null,"Transfer of vehicle type",null,null,null,null,0]
[null,null,"Any new function",null,null,null,null,0]
[null,"Third party eCall assessment",null,{"$f":"IF(COUNTIF(D48:G52,\"Pass\")>=2,1,IF(COUNTIF(D48:G52,\"Pass\")=1,0.5,0))","v":0}]
[]
[null,null,"Vehicle Submergence"]
[null,null,"Door opening check","PASS",null,null,null,{"$f":"IF(D56=\"PASS\",0.5,0)","v":0.5}]
[null,null,"Window opening check",null,null,null,null,{"$f":"IF(D57=\"PASS\",0.5,0)","v":0}]
[null,"Vehicle submergence assessment",null,{"$f":"SUM(H56:K57)","v":0.5}]
[]
[null,null,"Multi Collision Brake"]
[null,null,"Name",null,null,null,null,{"$f":"IF(AND(D61<>\"\",D62=\"PASS\",D63=\"PASS\",D64=\"PASS\"),1,0)","v":0}]
[null,null,"Description in manual"]
[null,null,"Deceleration during activation"]
[null,null,"Brake light activation"]
[null,"Multi-collision brake assessment",null,{"$f":"H61","v":0}]
[]
[null,"POST-CRASH TECHNOLOGY ASSESSMENT",null,{"$f":"SUM(D45+D53+D58+D65)","v":0.5}]
[]
[null,"SUMMARY"]
[null,null,"Rescue",{"$f":"D10","v":0}]
[null,null,"Extrication",{"$f":"D38","v":-1}]
[null,null,"Post-crash technology",{"$f":"D67","v":0.5}]
[]
[null,"TOTAL RESCUE, EXTRICATION & SAFETY",null,{"$f":"IF(D70<0,D70,SUM(D70:K72))","v":-0.5}]

{"sheet":"COP Dynamic","index":9,"n_rows":142,"n_cols":9,"rows_kept":142,"cut":false,"hidden":false,"merged":[[16,3,16,4],[16,5,16,6],[44,3,44,4],[44,5,44,6],[47,3,47,4],[47,5,47,6],[23,3,23,4],[24,3,24,4],[30,3,30,4],[23,5,23,6],[24,5,24,6],[30,5,30,6],[39,3,39,4],[39,5,39,6],[7,3,7,4],[7,5,7,6],[1,1,2,2],[1,3,2,4],[1,5,2,6],[3,1,3,2],[5,3,5,4],[5,5,5,6],[6,3,6,4],[6,5,6,6],[4,3,4,4],[4,5,4,6],[12,3,12,4],[12,5,12,6],[15,3,15,4],[15,5,15,6],[8,5,8,6],[8,3,8,4],[9,5,9,6],[9,3,9,4],[11,3,11,4],[11,5,11,6],[14,3,14,4],[14,5,14,6],[13,3,13,4],[13,5,13,6],[76,1,76,2],[22,1,22,2],[42,1,42,2],[42,3,42,4],[42,5,42,6],[52,1,52,2],[46,3,46,4],[46,5,46,6],[45,3,45,4],[45,5,45,6],[62,1,62,2],[62,3,62,4],[62,5,62,6],[70,1,70,2],[70,3,70,6],[64,1,64,2],[66,3,66,4],[66,5,66,6],[68,1,68,2],[68,3,68,4],[68,5,68,6],[28,1,28,2],[29,3,29,4],[29,5,29,6],[37,1,37,2],[65,3,65,4],[65,5,65,6],[53,3,53,4],[54,3,54,4],[53,5,53,6],[54,5,54,6],[56,3,56,4],[56,5,56,6],[59,3,59,4],[59,5,59,6]]}
[3]
[null,"Child Occupant Protection",null,"Q6",null,"Q10"]
[]
[null,{"$f":"_xlfn.CONCAT('General Overview'!G4, \" & \",'General Overview'!G6)","v":" & "},null,"Value","Points","Value","Points"]
[null,"CRS DETAILS"]
[null,null,"Child restraint"]
[null,null,"CRS make and model",{"$f":"IF('General Overview'!G41=\"\",\"\",'General Overview'!G41)","v":""},null,{"$f":"IF('General Overview'!G42=\"\",\"\",'General Overview'!G42)","v":""}]
[null,null,"Installation method"]
[null,null,"Type of CRS",null,null,"='General Overview'!G42"]
[null,null,"Recommended by vehicle manufacturer"]
[]
[null,"FRONTAL"]
[null,null,"Dummy restrained throughout impact?"]
[null,null,"Belt slipping of shoulder?"]
[null,null,"Submarining or upward movement in rebound?"]
[null,null,"CRS anchorage to vehicle failure?"]
[null,null,"Head"]
[null,null,"Hard contact"]
[null,null,"Peak resultant acceleration - g"]
[null,null,"HIC15",null,{"$f":"IF(D18=\"Yes\",Sliding_Scale(D20,500,700,4*IF('General Overview'!C17=0,2,1),0),\"\")","v":""},null,{"$f":"IF(F18=\"Yes\",Sliding_Scale(F20,500,700,4,0),\"\")","v":""}]
[null,null,"Head Resultant 3msec - g",null,{"$f":"ROUND(Sliding_Scale(D21,60,80,4,0),Round)","v":0},null,{"$f":"ROUND(Sliding_Scale(F21,60,80,4,0),Round)","v":0}]
[null,null,"Head Excursion (-2/-4) - mm",null,{"$f":"IF(D22=\"≥550\",-4,0)","v":0},null,{"$f":"IF(F22=\"≥550\",-4,IF(F22=\"≥450\",-2,0))","v":0}]
[null,"Head assessment",null,null,{"$f":"MAX(MIN(E20:E21)+E22,0)","v":0},null,{"$f":"MAX(MIN(G20:G21)+G22,0)","v":0}]
[]
[null,null,"Upper Neck"]
[null,null,"Belt interaction?"]
[null,null,"Tension (Upper neck Fz)",null,{"$f":"ROUND(Sliding_Scale(D27,1.7,2.62,2,0),Round)","v":0},null,{"$f":"ROUND(Sliding_Scale(F27,1.7,2.62,2,0),Round)","v":0}]
[null,null,"Extension (My)",null,{"$f":"IF(D18=\"Yes\",IF(D28<36,2,0),\"\")","v":""},null,{"$f":"IF(F18=\"Yes\",IF(F28<49,2,0),\"\")","v":""}]
[null,"Upper Neck assessment",null,null,{"$f":"MAX(MIN(E27:E28),0)","v":0},null,{"$f":"MAX(MIN(G27:G28),0)","v":0}]
[]
[null,null,"Chest (T4)"]
[null,null,"Peak resultant acceleration - g"]
[null,null,"Chest Resultant 3msec - g",null,null,null,{"$f":"ROUND(Sliding_Scale(F33,41,55,2,0),Round)","v":0}]
[null,null,"Upper chest deflection  (resultant) - mm"]
[null,null,"Lower chest deflection  (resultant) - mm"]
[null,null,"Chest Deflection - mm",null,{"$f":"ROUND(Sliding_Scale(D36,30,42,2,0),Round)","v":0},null,{"$f":"IF(F36>=56,-2,0)","v":0}]
[null,null,"Shoulder belt load - (kN)"]
[null,"Chest assessment",null,null,{"$f":"E36","v":0},null,{"$f":"MAX(MIN(SUM(G33:G36)),0)","v":0}]
[]
[null,null,"Pelvis"]
[null,null,"Peak resultant acceleration - g"]
[null,null,"Pelvis Resultant 3msec - g"]
[null,"Front assessment",null,{"$f":"IF(OR(D14=\"Yes\",D15=\"Yes\",D16=\"Yes\",D20>800,D21>80),0,MAX(SUM(E23,E29,E38)+IF(D14=\"Partial\",-4,0),0))","v":0},null,{"$f":"IF(OR(F14=\"Yes\",F15=\"Yes\",F16=\"Yes\",F20>800,F21>80),0,MAX(SUM(G23,G29,G38)+IF(F14=\"Partial\",-4,0),0))","v":0}]
[]
[null,"SIDE"]
[null,null,"Dummy restrained throughout impact?"]
[null,null,"CRS anchorage to vehicle failure?"]
[null,null,"Head"]
[null,null,"Bottoming out or contact with interior?"]
[null,null,"Peak resultant acceleration - g"]
[null,null,"HIC15",null,{"$f":"IF(D49=\"Yes\",Sliding_Scale(D51,500,700,2,0),\"\")","v":""},null,{"$f":"IF(F49=\"Yes\",Sliding_Scale(F51,500,700,2,0),\"\")","v":""}]
[null,null,"Head Resultant 3msec - g",null,{"$f":"ROUND(Sliding_Scale(D52,60,80,2,0),Round)","v":0},null,{"$f":"ROUND(Sliding_Scale(F52,60,80,2,0),Round)","v":0}]
[null,"Head assessment",null,null,{"$f":"MAX(MIN(E51:E52),0)","v":0},null,{"$f":"MAX(MIN(G51:G52),0)","v":0}]
[]
[null,null,"Neck"]
[null,null,"Resultant Force (Upper neck)",null,{"$f":"IF(D56=\"\",0,IF(D56>=2.4,0,1))","v":0},null,{"$f":"IF(F56=\"\",0,IF(F56>=2.2,0,1))","v":0}]
[null,null,"Chest (T4)"]
[null,null,"Peak resultant acceleration - g"]
[null,null,"Chest Resultant 3msec - g",null,{"$f":"IF(D59=\"\",0,IF(D59>=67,0,1))","v":0},null,{"$f":"IF(F59=\"\",0,IF(F59>=67,0,1))","v":0}]
[null,null,"Pelvis"]
[null,null,"Peak resultant acceleration - g"]
[null,null,"Pelvis Resultant 3msec - g"]
[null,"Side assessment",null,{"$f":"IF(OR(D46=\"No\",D47=\"Yes\",D51>800,D52>80),0,SUM(E53,E56,E59))","v":0},null,{"$f":"IF(OR(F46=\"No\",F47=\"Yes\",F51>800,F52>80),0,SUM(G53,G56,G59))","v":0}]
[]
[null,"SUMMARY"]
[null,null,"Front assessment",{"$f":"D43","v":0},null,{"$f":"F43","v":0}]
[null,null,"Side assessment",{"$f":"D63","v":0},null,{"$f":"F63","v":0}]
[]
[null,"TOTAL",null,{"$f":"ROUND(SUM(D66:E67),Round)","v":0},null,{"$f":"ROUND(SUM(F66:G67),Round)","v":0}]
[]
[null,"TOTAL DYNAMIC ASSESSMENT",null,{"$f":"ROUND(SUM(D69:G69)*IF('General Overview'!C17=0,2,1),Round)","v":0}]
[]
[]
[]
[]
[null,null,null,"Q6","Q6","Q10","Q10",null,"Just text added, no row inserted."]
[null,"DUMMY MEASUREMENTS",null,"Frontal","Side","Frontal","Side"]
[null,"Head"]
[null,"Ax","Max"]
[null,null,"Min"]
[null,"Ay","Max"]
[null,null,"Min"]
[null,"Az","Max"]
[null,null,"Min"]
[null,"Neck"]
[null,"Fx","Max"]
[null,null,"Min"]
[null,"Fy","Max"]
[null,null,"Min"]
[null,"Fz","Max"]
[null,null,"Min"]
[null,"Mx","Max"]
[null,null,"Min"]
[null,"My","Max"]
[null,null,"Min"]
[null,"Mz","Max"]
[null,null,"Min"]
[null,"Shoulder"]
[null,"Fx","Max"]
[null,null,"Min"]
[null,"Fy","Max"]
[null,null,"Min"]
[null,"Fz","Max"]
[null,null,"Min"]
[null,"T1"]
[null,"Ay","Max"]
[null,"Chest"]
[null,"Ax","Max"]
[null,null,"Min"]
[null,"Ay","Max"]
[null,null,"Min"]
[null,"Az","Max"]
[null,null,"Min"]
[null,"Dchest","Max"]
[null,null,"Min"]
[null,"LO","Max"]
[null,null,"Min"]
[null,"UP","Max"]
[null,null,"Min"]
[null,"Lumbar Spine (lower)"]
[null,"Fx","Max"]
[null,null,"Min"]
[null,"Fy","Max"]
[null,null,"Min"]
[null,"Fz","Max"]
[null,null,"Min"]
[null,"Mx","Max"]
[null,null,"Min"]
[null,"My","Max"]
[null,null,"Min"]
[null,"Mz","Max"]
[null,null,"Min"]
[null,"Pelvis-Sacrum"]
[null,"Ax","Max"]
[null,null,"Min"]
[null,"Ay","Max"]
[null,null,"Min"]
[null,"Az","Max"]
[null,null,"Min"]
[null,"Pelvis-Pubis"]
[null,"Fy","Max"]
[null,null,"Min"]

{"sheet":"COP Vehicle Based","index":10,"n_rows":63,"n_cols":10,"rows_kept":63,"cut":false,"hidden":false,"merged":[[24,3,24,9],[37,3,37,9],[56,7,57,7],[56,3,57,3],[56,4,57,4],[56,5,57,5],[56,6,57,6],[35,3,35,9],[59,1,59,2],[60,1,60,2],[61,1,61,2],[62,1,62,2],[56,1,57,2],[1,1,2,2],[1,3,2,3],[1,4,2,6],[1,7,2,9],[3,1,3,2],[12,1,12,2],[17,1,17,2],[9,3,9,9],[11,3,11,9],[12,3,12,9],[17,3,17,9],[28,1,28,2],[27,3,27,9],[28,3,28,9],[33,1,33,2],[44,1,44,2],[46,1,46,2],[33,3,33,9],[44,3,44,9],[46,3,46,9],[36,3,36,9],[40,3,40,9],[41,3,41,9],[38,3,38,9],[39,3,39,9],[42,3,42,9],[43,3,43,9],[35,17,35,23],[36,17,36,23],[37,17,37,23],[38,17,38,23],[39,17,39,23],[40,17,40,23],[41,17,41,23],[42,17,42,23],[43,17,43,23],[44,17,44,23]]}
[]
[null,"Vehicle based assessment",null,"Front","2nd row",null,null,"3rd row"]
[]
[null,null,null,"Passenger(s)","Left","Centre","Right","Left","Centre","Right"]
[null,"SEATING POSITIONS"]
[null,null,"Provision of three-point seat belts  "]
[null,null,"Inflatable belt or rear airbag"]
[]
[null,"WEBSITE INFORMATION FORM"]
[null,null,"OEM data provided?"]
[null,"VEHICLE HANDBOOK INFORMATION"]
[null,null,"R16 compliant?"]
[null,"Eligibility for scoring",null,{"$f":"IF(AND(COUNTIF(D6:J6,\"Yes\")=(1+SUM('General Overview'!C17:D18)),D10=\"OK\",D12=\"OK\"),\"Yes\",\"No\")","v":"No"}]
[]
[null,"GABARIT INSTALLATION"]
[null,null,"Gabarit installation & belt length"]
[null,null,"ISO/B2 fixture installation - belted only"]
[null,"Gabarit installation score",null,{"$f":"IF(AND(E16=\"Pass\",G16=\"Pass\"),1,0)+IF(COUNTIF(D16:J16,\"Pass\")=(1+SUM('General Overview'!C17:D18)),1,0)","v":0}]
[]
[null,"i-SIZE AND TOP TETHER MARKING"]
[null,null,"i-Size marking requirements"]
[null,null,"i-Size availabilty - ISO/B2 i-Size fixture as R16"]
[null,null,null,{"$f":"IF(D21=\"\",\"\",IF(AND(D21:D22=\"Pass\"),\"Pass\",\"Fail\"))","v":""},{"$f":"IF(E21=\"\",\"\",IF(AND(E21:E22=\"Pass\"),\"Pass\",\"Fail\"))","v":""},{"$f":"IF(F21=\"\",\"\",IF(AND(F21:F22=\"Pass\"),\"Pass\",\"Fail\"))","v":""},{"$f":"IF(G21=\"\",\"\",IF(AND(G21:G22=\"Pass\"),\"Pass\",\"Fail\"))","v":""},{"$f":"IF(H21=\"\",\"\",IF(AND(H21:H22=\"Pass\"),\"Pass\",\"Fail\"))","v":""},{"$f":"IF(I21=\"\",\"\",IF(AND(I21:I22=\"Pass\"),\"Pass\",\"Fail\"))","v":""},{"$f":"IF(J21=\"\",\"\",IF(AND(J21:J22=\"Pass\"),\"Pass\",\"Fail\"))","v":""}]
[null,null,"ISO/B2 installation - belt and ISOFIX"]
[null,null,"i-Size availability",{"$f":"IF(AND('General Overview'!C19=\"Roadster sports\",D23=\"Pass\"),2,IF(COUNTIF(D23:J23,\"Pass\")>=2,2,0))","v":0}]
[null,null,"Ability to install ISO/R3"]
[null,null,null,{"$f":"IF(D26=\"\",\"\",IF(AND(D26=\"Pass\",D23=\"Pass\"),\"Pass\",\"Fail\"))","v":""},{"$f":"IF(E26=\"\",\"\",IF(AND(E26=\"Pass\",E23=\"Pass\"),\"Pass\",\"Fail\"))","v":""},"","","","",""]
[null,null,"Three or more i-Size positions AND two ISO/R3",{"$f":"IF(AND('General Overview'!C19=\"Roadster sports\",D27=\"Pass\"),1,IF(COUNTIF(D27:J27,\"Pass\")>=3,1,0))","v":0}]
[null,"i-Size and top tether marking score",null,{"$f":"SUM(D25+D28)","v":0}]
[]
[null,"PASSENGER AIRBAG WARNING MARKING AND DISABLING"]
[null,null,"Manual airbag disabling switch"]
[null,null,"Automatic airbag disabling switch"]
[null,"Passenger airbag warning marking and disabling score",null,{"$f":"IF(D33=\"Pass\",4,IF(D32=\"Pass\",2,0))","v":0}]
[]
[null,"CHILD PRESENCE DETECTION",null,{"$f":"'General Overview'!F48","v":0}]
[null,null,"Sensing type - Direct or indirect"]
[null,null,"Alert, warning & intervention"]
[null,null,"System coverage - seating positions"]
[null,null,"Child scenarios covered - 1, 2, 3"]
[null,null,"Occupant space coverage - (2025 onwards)"]
[null,null,"System functionality check"]
[null,null,"Warning and intervention check"]
[null,null,null,{"$f":"IF(AND(D36=\"Standard\",D42=\"Pass\",D43=\"Pass\",ISNUMBER(SEARCH(\"&\",D40))),\"Pass\",\"Fail\")","v":"Fail"}]
[null,"CPD scoring",null,{"$f":"IF(D44=\"Fail\",0,IF(D38=\"USC alert\",0.25,IF(AND(D38=\"Initial ONLY\",D37=\"indirect\"),1,IF(AND(D38=\"Initial ONLY\",D37=\"Direct\"),1.5,IF(AND(D37=\"Direct\",D38=\"Initial & Escalation\"),3,IF(AND(D37=\"Direct\",D38=\"Initial Escalation & Intervention\"),4,0))))/IF(D39=\"Rear seats only\",2,1)))","v":0}]
[]
[null,"TOTAL VEHICLE BASED ASSESSMENT",null,{"$f":"IF(D13=\"Yes\",SUM(D18,D29,D34,D45),0)","v":0}]
[]
[]
[]
[]
[]
[]
[]
[]
[]
[null,"Website table",null,"Front Passenger","2nd row Outboard","2nd row Centre","3rd row Outboard","3rd row Centre"]
[]
[]
[null,null,null,"Value","Value","Value","Value","Value"]
[null,"ISOFIX"]
[null,"iSize"]
[null,"Integrated CRS"]

{"sheet":"COP CRS Installation","index":11,"n_rows":46,"n_cols":23,"rows_kept":46,"cut":false,"hidden":false,"merged":[[43,2,43,4],[44,2,44,4],[45,2,45,4],[32,2,32,4],[38,2,38,4],[39,2,39,4],[40,2,40,4],[41,2,41,4],[42,2,42,4],[33,2,33,4],[34,2,34,4],[35,2,35,4],[36,2,36,4],[37,2,37,4],[4,5,4,6],[1,1,3,6],[1,7,1,15],[1,16,2,19],[2,7,2,9],[2,10,2,12],[2,13,2,15],[9,3,9,4],[10,3,10,4],[5,3,5,4],[6,3,6,4],[7,3,7,4],[8,3,8,4],[15,16,16,18],[15,19,17,19],[14,3,14,4],[13,3,13,4],[11,3,11,4],[12,3,12,4],[34,5,39,5],[40,5,45,5],[1,20,3,21],[22,2,22,6],[22,7,22,19],[24,1,24,6],[24,7,24,19],[21,2,21,6],[21,7,21,19],[16,3,16,4],[17,3,17,4],[18,3,18,4],[20,1,20,6],[20,7,20,19],[15,1,18,1],[15,3,15,4]]}
[]
[null,"CRS Installation Assessment",null,null,null,null,null,"SEATING POSITION",null,null,null,null,null,null,null,null,"SCORING",null,null,null,"CRS type"]
[null,null,null,null,null,null,null,"Front",null,null,"2nd row",null,null,{"$f":"IF(OR('General Overview'!C18>1,'General Overview'!C18=\"\"),\"3rd row\",\"3rd\")","v":"3rd row"}]
[null,null,null,null,null,null,null,"Left","Centre","Right","Left","Centre","Right","Left","Centre","Right","Pass","Fail","Exempt","Score"]
[null,null,"Stature",null,null,"Vehicle provisions",null,null,null,null,null,null,null,null,null,null,null,null,null,null,"Facing"]
[null,1,"< 83cm","Maxi Cosi Pebble 360",null,"B _ _ _","ISO/R2",null,null,null,null,null,null,null,null,null,{"$f":"COUNTIF($H6:$P6,\"Pass\")","v":0},{"$f":"COUNTIF($H6:$P6,\"Fail\")+COUNTIF($H6:$P6,\"P Fail\")","v":0},0,{"$f":"IF(SUM(Q6:S6)=0,\"\",Q6/(Q6+R6))","v":""},"Rearward","Universal belted"]
[null,{"$f":"B6+1","v":2},"135cm","Britax Kidfix i-Size",null,"B _ _ _","ISO/B2",null,null,null,null,null,null,null,null,null,0,0,0,{"$f":"IF(SUM(Q7:S7)=0,\"\",Q7/(Q7+R7))","v":""},"Forward","i-Size booster seat","Belt Installed"]
[null,{"$f":"B7+1","v":3},"150cm","Cybex Solution Z i-Fix",null,"B _ _ _","ISO/B3",null,null,null,null,null,null,null,null,null,0,0,0,{"$f":"IF(SUM(Q8:S8)=0,\"\",Q8/(Q8+R8))","v":""},"Forward","Specific vehicle booster seat"]
[null,4,"135cm","Cybex Solution Z i-Fix",null,"B I _ _","ISO/B3",null,null,null,null,null,null,null,null,null,0,0,0,{"$f":"IF(SUM(Q9:S9)=0,\"\",Q9/(Q9+R9))","v":""},"Forward","Specific vehicle booster seat","ISOFIX"]
[null,5,"150cm","Cybex Solution Z i-Fix",null,"B I _ _","ISO/B3",null,null,null,null,null,null,null,null,null,0,0,0,{"$f":"IF(SUM(Q10:S10)=0,\"\",Q10/(Q10+R10))","v":""},"Forward","Specific vehicle booster seat"]
[null,6,"40-105cm","Maxi Cosi Pearl 360 & FamilyFix 360",null,"_ I L _","ISO/R2",null,null,null,null,null,null,null,null,null,0,0,{"$f":"COUNTIF($H11:$P11,\"Exempt\")","v":0},{"$f":"IF(SUM(Q11:S11)=0,\"\",(Q11+S11)/(Q11+R11+S11))","v":""},"Rearward","i-Size universal ISOFIX"]
[null,7,"150CM","Maxi Cosi Pearl 360 & FamilyFix 360",null,"_ I L _","F2X",null,null,null,null,null,null,null,null,null,0,0,0,{"$f":"IF(SUM(Q12:S12)=0,\"\",(Q12+S12)/(Q12+R12+S12))","v":""},"Forward","i-Size universal ISOFIX"]
[null,8,"61-105cm","BeSafe iZi Kid X2 i-Size",null,"_ I L _","ISO/R2",null,null,null,null,null,null,null,null,null,0,0,0,"","Rearward","i-Size universal ISOFIX","iSize"]
[null,9,"76-105cm","Britax Römer TriFix2 i-Size",null,"_ I _ S","F2X",null,null,null,null,null,null,null,null,null,0,0,0,{"$f":"IF(SUM(Q14:S14)=0,\"\",Q14/(Q14+R14))","v":""},"Forward","i-Size universal ISOFIX"]
[null,{"$f":"B14+1","v":10},"100-135cm","BeSafe iZi Flex FIX i-Size",null,"B I _ _","ISO/B2",null,null,null,null,null,null,null,null,null,0,0,0,"","Forward","i-Size universal ISOFIX"]
[null,"Recommended","0-84",null,null,null,null,null,null,null,null,null,null,null,null,null,null,null,null,{"$f":"IF(VALUE(TRIM(RIGHT(C16,LEN(C16)-FIND(\"-\",C16,1))))>=83,IF(U16=\"rearward\",IF('General Overview'!C17=0,IF(AND(COUNTIF(F16:G18,\"\")=0,Q18=1),1,0),IF(AND(COUNTIF(F16:G18,\"\")=0,Q18=2),1,0)),0),0)","v":0},"Rearward","Up to 83cm must be RWF"]
[null,null,"100-135",null,null,null,null,null,null,null,null,null,null,null,null,null,null,null,null,null,"Forward"]
[null,null,"100-135",null,null,null,null,null,null,null,null,null,null,null,null,null,0,{"$f":"COUNTIF($H18:$P18,\"Fail\")+COUNTIF($H18:$P18,\"P Fail\")","v":0},null,null,"Forward"]
[null,null,"100-150",null,null,null,null,null,null,null,null,null,null,null,null,null,0,{"$f":"COUNTIF($H19:$P19,\"Fail\")+COUNTIF($H19:$P19,\"P Fail\")","v":0},null,{"$f":"IF(VALUE(TRIM(RIGHT(C19,LEN(C19)-FIND(\"-\",C19,1))))=150,IF('General Overview'!C17=0,IF(Q19=1,1,0),IF(Q19=2,1,0)),0)","v":0},"Forward","Must be up to and including 150cm"]
[]
[null,"SUMMARY"]
[null,null,"Installation assessment",null,null,null,null,{"$f":"SUM(T6:T15)","v":0}]
[null,null,"OEM assessment",null,null,null,null,{"$f":"T16+T19","v":0}]
[]
[null,"TOTAL INSTALLATION ASSESSMENT",null,null,null,null,null,{"$f":"SUM(H22:T23)","v":0}]
[]
[]
[]
[null,null,null,null,null,null,"iSize",{"$f":"IF(AND(H11:H15=\"N/A\"),\"N/A\",IF(OR(H11:H15=\"Fail\"),\"Fail\",IF(OR(H11:H15=\"P Fail\"),\"P Fail\",IF(AND(H11:H15=\"Pass\"),\"Pass\",\"ERROR\"))))","v":"ERROR"},{"$f":"IF(AND(I11:I15=\"N/A\"),\"N/A\",IF(OR(I11:I15=\"Fail\"),\"Fail\",IF(OR(I11:I15=\"P Fail\"),\"P Fail\",IF(AND(I11:I15=\"Pass\"),\"Pass\",\"ERROR\"))))","v":"ERROR"},{"$f":"IF(AND(J11:J15=\"N/A\"),\"N/A\",IF(OR(J11:J15=\"Fail\"),\"Fail\",IF(OR(J11:J15=\"P Fail\"),\"P Fail\",IF(AND(J11:J15=\"Pass\"),\"Pass\",\"ERROR\"))))","v":"ERROR"},{"$f":"IF(AND(K11:K15=\"N/A\"),\"N/A\",IF(OR(K11:K15=\"Fail\"),\"Fail\",IF(OR(K11:K15=\"P Fail\"),\"P Fail\",IF(AND(K11:K15=\"Pass\"),\"Pass\",\"ERROR\"))))","v":"ERROR"},{"$f":"IF(AND(L11:L15=\"N/A\"),\"N/A\",IF(OR(L11:L15=\"Fail\"),\"Fail\",IF(OR(L11:L15=\"P Fail\"),\"P Fail\",IF(AND(L11:L15=\"Pass\"),\"Pass\",\"ERROR\"))))","v":"ERROR"},{"$f":"IF(AND(M11:M15=\"N/A\"),\"N/A\",IF(OR(M11:M15=\"Fail\"),\"Fail\",IF(OR(M11:M15=\"P Fail\"),\"P Fail\",IF(AND(M11:M15=\"Pass\"),\"Pass\",\"ERROR\"))))","v":"ERROR"},{"$f":"IF(AND(N11:N15=\"N/A\"),\"N/A\",IF(OR(N11:N15=\"Fail\"),\"Fail\",IF(OR(N11:N15=\"P Fail\"),\"P Fail\",IF(AND(N11:N15=\"Pass\"),\"Pass\",\"ERROR\"))))","v":"ERROR"},{"$f":"IF(AND(O11:O15=\"N/A\"),\"N/A\",IF(OR(O11:O15=\"Fail\"),\"Fail\",IF(OR(O11:O15=\"P Fail\"),\"P Fail\",IF(AND(O11:O15=\"Pass\"),\"Pass\",\"ERROR\"))))","v":"ERROR"},{"$f":"IF(AND(P11:P15=\"N/A\"),\"N/A\",IF(OR(P11:P15=\"Fail\"),\"Fail\",IF(OR(P11:P15=\"P Fail\"),\"P Fail\",IF(AND(P11:P15=\"Pass\"),\"Pass\",\"ERROR\"))))","v":"ERROR"}]
[null,null,null,null,null,null,"ISOFIX",{"$f":"IF(AND(H9:H10=\"N/A\"),\"N/A\",IF(OR(H9:H10=\"Fail\"),\"Fail\",IF(OR(H9:H10=\"P Fail\"),\"P Fail\",IF(AND(H9:H10=\"Pass\"),\"Pass\",\"ERROR\"))))","v":"ERROR"},{"$f":"IF(AND(I9:I10=\"N/A\"),\"N/A\",IF(OR(I9:I10=\"Fail\"),\"Fail\",IF(OR(I9:I10=\"P Fail\"),\"P Fail\",IF(AND(I9:I10=\"Pass\"),\"Pass\",\"ERROR\"))))","v":"ERROR"},{"$f":"IF(AND(J9:J10=\"N/A\"),\"N/A\",IF(OR(J9:J10=\"Fail\"),\"Fail\",IF(OR(J9:J10=\"P Fail\"),\"P Fail\",IF(AND(J9:J10=\"Pass\"),\"Pass\",\"ERROR\"))))","v":"ERROR"},{"$f":"IF(AND(K9:K10=\"N/A\"),\"N/A\",IF(OR(K9:K10=\"Fail\"),\"Fail\",IF(OR(K9:K10=\"P Fail\"),\"P Fail\",IF(AND(K9:K10=\"Pass\"),\"Pass\",\"ERROR\"))))","v":"ERROR"},{"$f":"IF(AND(L9:L10=\"N/A\"),\"N/A\",IF(OR(L9:L10=\"Fail\"),\"Fail\",IF(OR(L9:L10=\"P Fail\"),\"P Fail\",IF(AND(L9:L10=\"Pass\"),\"Pass\",\"ERROR\"))))","v":"ERROR"},{"$f":"IF(AND(M9:M10=\"N/A\"),\"N/A\",IF(OR(M9:M10=\"Fail\"),\"Fail\",IF(OR(M9:M10=\"P Fail\"),\"P Fail\",IF(AND(M9:M10=\"Pass\"),\"Pass\",\"ERROR\"))))","v":"ERROR"},{"$f":"IF(AND(N9:N10=\"N/A\"),\"N/A\",IF(OR(N9:N10=\"Fail\"),\"Fail\",IF(OR(N9:N10=\"P Fail\"),\"P Fail\",IF(AND(N9:N10=\"Pass\"),\"Pass\",\"ERROR\"))))","v":"ERROR"},{"$f":"IF(AND(O9:O10=\"N/A\"),\"N/A\",IF(OR(O9:O10=\"Fail\"),\"Fail\",IF(OR(O9:O10=\"P Fail\"),\"P Fail\",IF(AND(O9:O10=\"Pass\"),\"Pass\",\"ERROR\"))))","v":"ERROR"},{"$f":"IF(AND(P9:P10=\"N/A\"),\"N/A\",IF(OR(P9:P10=\"Fail\"),\"Fail\",IF(OR(P9:P10=\"P Fail\"),\"P Fail\",IF(AND(P9:P10=\"Pass\"),\"Pass\",\"ERROR\"))))","v":"ERROR"}]
[null,null,null,null,null,null,"Belt Attached",{"$f":"IF(AND(H6:H8=\"N/A\"),\"N/A\",IF(OR(H6:H8=\"Fail\"),\"Fail\",IF(OR(H6:H8=\"P Fail\"),\"P Fail\",IF(AND(H6:H8=\"Pass\"),\"Pass\",\"ERROR\"))))","v":"ERROR"},{"$f":"IF(AND(I6:I8=\"N/A\"),\"N/A\",IF(OR(I6:I8=\"Fail\"),\"Fail\",IF(OR(I6:I8=\"P Fail\"),\"P Fail\",IF(AND(I6:I8=\"Pass\"),\"Pass\",\"ERROR\"))))","v":"ERROR"},{"$f":"IF(AND(J6:J8=\"N/A\"),\"N/A\",IF(OR(J6:J8=\"Fail\"),\"Fail\",IF(OR(J6:J8=\"P Fail\"),\"P Fail\",IF(AND(J6:J8=\"Pass\"),\"Pass\",\"ERROR\"))))","v":"ERROR"},{"$f":"IF(AND(K6:K8=\"N/A\"),\"N/A\",IF(OR(K6:K8=\"Fail\"),\"Fail\",IF(OR(K6:K8=\"P Fail\"),\"P Fail\",IF(AND(K6:K8=\"Pass\"),\"Pass\",\"ERROR\"))))","v":"ERROR"},{"$f":"IF(AND(L6:L8=\"N/A\"),\"N/A\",IF(OR(L6:L8=\"Fail\"),\"Fail\",IF(OR(L6:L8=\"P Fail\"),\"P Fail\",IF(AND(L6:L8=\"Pass\"),\"Pass\",\"ERROR\"))))","v":"ERROR"},{"$f":"IF(AND(M6:M8=\"N/A\"),\"N/A\",IF(OR(M6:M8=\"Fail\"),\"Fail\",IF(OR(M6:M8=\"P Fail\"),\"P Fail\",IF(AND(M6:M8=\"Pass\"),\"Pass\",\"ERROR\"))))","v":"ERROR"},{"$f":"IF(AND(N6:N8=\"N/A\"),\"N/A\",IF(OR(N6:N8=\"Fail\"),\"Fail\",IF(OR(N6:N8=\"P Fail\"),\"P Fail\",IF(AND(N6:N8=\"Pass\"),\"Pass\",\"ERROR\"))))","v":"ERROR"},{"$f":"IF(AND(O6:O8=\"N/A\"),\"N/A\",IF(OR(O6:O8=\"Fail\"),\"Fail\",IF(OR(O6:O8=\"P Fail\"),\"P Fail\",IF(AND(O6:O8=\"Pass\"),\"Pass\",\"ERROR\"))))","v":"ERROR"},{"$f":"IF(AND(P6:P8=\"N/A\"),\"N/A\",IF(OR(P6:P8=\"Fail\"),\"Fail\",IF(OR(P6:P8=\"P Fail\"),\"P Fail\",IF(AND(P6:P8=\"Pass\"),\"Pass\",\"ERROR\"))))","v":"ERROR"}]
[]
[null,null,"Description",null,null,"Category","Type",null,"Pass_AB_On","Pass_AB_Off","R2_L","R2_C","R2_R","R3_L","R3_C","R3_R"]
[null,null,"All",null,null,"iSize",1]
[null,null,"Specific vehicle ISOFIX (forward facing) with integral harness or shield",null,null,"ISOFIX",1]
[null,null,"Specific  vehicle ISOFIX (rearward facing) with integral harness – R3 flag",null,null,null,2]
[null,null,"Specific vehicle ISOFIX booster seat (forward facing)",null,null,null,3]
[null,null,"Specific vehicle ISOFIX booster cushion",null,null,null,4]
[null,null,"Specific vehicle ISOFIX base with support leg (forward facing)",null,null,null,5]
[null,null,"Specific vehicle ISOFIX base with support leg (rearward facing)",null,null,null,6]
[null,null,"Rearward facing belted child seat with integral harness ",null,null,"Belt Attached",1]
[null,null,"Forward facing belted child seat with integral harness or shield",null,null,null,2]
[null,null,"Forward facing belted booster seat ",null,null,null,3]
[null,null,"Belted booster cushion covering B3",null,null,null,4]
[null,null,"Belted base with support leg (forward facing)",null,null,null,5]
[null,null,"Belted base with support leg (rearward facing)",null,null,null,6]

{"sheet":"COP OEM Information","index":12,"n_rows":55,"n_cols":21,"rows_kept":55,"cut":false,"hidden":false,"merged":[[7,3,7,4],[10,0,54,0],[10,1,30,1],[31,1,54,1],[4,1,4,2],[4,3,4,4],[4,7,4,13],[5,1,5,2],[5,3,5,4],[5,7,5,13],[1,3,1,4],[1,6,6,6],[1,7,1,12],[2,3,2,4],[2,7,2,12],[3,3,3,4],[6,3,6,4],[6,7,6,13]]}
[null,"OEM Spreadsheet detailing Vehicle information regarding Child Occupant Protection",null,null,null,null,null,null,"Table is to be completed by the OEM. "]
[null,null,"Vehicle make:",null,null,null,"Comments about this table","Each row has a specific Validation List to use to chose the answer. Any further information can be added in the comments section. "]
[null,null,"Vehicle model:",null,null,null,null,"Information must be provided regarding both standard and optional equipment. "]
[null,null,"Assessment year:"]
[null,"Is there any difference between RHD and LHD?",null,null,null,null,null,"To help you fill in the table, there are formulas that can hide cells depending on a previous question. But once you select the choice in the list, the formula has disappeared."]
[null,{"$f":"IF(LEFT(D5,2)=\"No\",\"\",\"table for this specific Hand of Drive: \")","v":"table for this specific Hand of Drive: "},null,null,null,null,null,"For this reason, if you have to come back to the original formula please go to row T and row U, the original formulas are there."]
[null,null,"Filled in by:",null,null,null,null,"This table goes together with the table \"for website\" which is a sketch of the possible visual display that can be on the website"]
[null,null,"Date of modification:"]
[null,null,null,null,null,null,"Row 1",null,null,"Row 2",null,null,"Row 3"]
[null,null,"VEHICLE PROVISIONS",null,null,"Driver","Centre","Front Passenger","Left","Centre","Right","Left","Centre","Right","Comments to the user of this table","Comments from the user",null,null,null,"Template front row","Template rear row"]
["Data to be provided by the OEM in advance from the assessment",null,"Vehicle general characteristics"]
[null,null,"Seat arrangement "]
[null,null,"Row 1 frontal airbag deactivation",null,null,null,null,null,"N/A","N/A","N/A","N/A","N/A","N/A",null,null,null,null,null,null,"N/A"]
[null,null,"Row 2 or Row 3 frontal protection airbag and its deactivation",null,null,null,"N/A","N/A",null,null,null,null,null,"","Where applicable as either standard or optional equipment",null,null,null,null,"N/A"]
[null,null,"inflating seat belt",null,null,null,null,null,null,null,null,null,null,"","Where applicable as either standard or optional equipment"]
[null,null,"Seat orientation",null,null,null,null,null,null,null,null,null,null,null,"Where applicable "]
[null,null,"Seat adjustment possibilities",null,null,null,null,null,null,null,null,null,null,"","put optional if one adjustment (or more) is not standard"]
[null,null,null,"seatback angle",null,null,null,null,null,null,null,null,null,""]
[null,null,null,"seat fore/aft",null,null,null,null,null,null,null,null,null,""]
[null,null,null,"seat height",null,null,null,null,null,null,null,null,null,""]
[null,null,null,"extra comfort equipment",null,null,null,null,null,null,null,null,null,""]
[null,null,null,"full seat stowable / foldable or removable",null,null,null,null,null,null,null,null,null,null,"stowable means sinking in the floor. Foldable does not apply to the folding of the seatback only but of the complete seat"]
[null,null,"Head Restraint adjustment possibilities",null,null,null,null,null,null,null,null,null,null,""]
[null,null,null,"non-use / stowable position",null,null,null,null,null,null,null,null,null,""]
[null,null,null,"HR height",null,null,null,null,null,null,null,null,null,""]
[null,null,null,"HR tilt",null,null,null,null,null,null,null,null,null,""]
[null,null,null,"HR fore/aft",null,null,null,null,null,null,null,null,null,""]
[null,null,null,"HR removable",null,null,null,null,null,null,null,null,null,""]
[null,null,"Seat belts",null,null,null,null,null,null,null,null,null,null,""]
[null,null,null,"presence of secondary buckle for the belt anchorage",null,null,null,null,null,null,null,null,null,"","Where applicable - provide details how to attach bucke and if a specific path is required"]
[null,null,"Floor storage in front of the seat position, in the possible support leg area",null,null,null,null,null,null,null,null,null,null,"","Where applicable as either standard or optional equipment"]
[null,"OEM data will be checked with CRS installation","Specificities dedicated to Child Protection"]
[null,null,"CRS Forward Facing allowed with Frontal airbag ON",null,null,null,{"$f":"IF(G$12=\"Not available\",\"N/A\",IF(G$13=\"no airbag\",\"N/A\",\"??\"))","v":"??"},{"$f":"IF(H$12=\"Not available\",\"N/A\",IF(H$13=\"no airbag\",\"N/A\",\"??\"))","v":"??"},{"$f":"IF(I$12=\"Not available\",\"N/A\",IF(I$14=\"no airbag\",\"N/A\",\"??\"))","v":"??"},{"$f":"IF(J$12=\"Not available\",\"N/A\",IF(J$14=\"no airbag\",\"N/A\",\"??\"))","v":"??"},"??","??","??","??",null,null,null,null,null,{"$f":"IF(T$12=\"Not available\",\"N/A\",IF(T$13=\"no airbag\",\"N/A\",\"??\"))","v":"??"},{"$f":"IF(U$12=\"Not available\",\"N/A\",IF(U$14=\"no airbag\",\"N/A\",\"??\"))","v":"??"}]
[null,null,"CRS Forward Facing allowed with Frontal airbag OFF",null,null,null,{"$f":"IF(G$12=\"Not available\",\"N/A\",IF(G$13=\"no airbag\",\"N/A\",\"??\"))","v":"??"},{"$f":"IF(H$12=\"Not available\",\"N/A\",IF(H$13=\"no airbag\",\"N/A\",\"??\"))","v":"??"},{"$f":"IF(I$12=\"Not available\",\"N/A\",IF(I$14=\"no airbag\",\"N/A\",\"??\"))","v":"??"},"??","??","??","??","??",null,null,null,null,null,{"$f":"IF(T$12=\"Not available\",\"N/A\",IF(T$13=\"no airbag\",\"N/A\",\"??\"))","v":"??"},{"$f":"IF(U$12=\"Not available\",\"N/A\",IF(U$14=\"no airbag\",\"N/A\",\"??\"))","v":"??"}]
[null,null,"CRS Rearward Facing allowed with Frontal airbag OFF",null,null,null,{"$f":"IF(G$12=\"Not available\",\"N/A\",IF(G$14=\"no deactivation\",\"CRS forbidden\",IF(G$14=\"no airbag\",\"N/A\",\"??\")))","v":"??"},"??",{"$f":"IF(I$12=\"Not available\",\"N/A\",IF(I$14=\"no deactivation\",\"CRS forbidden\",IF(I$14=\"no airbag\",\"N/A\",\"??\")))","v":"??"},{"$f":"IF(J$12=\"Not available\",\"N/A\",IF(J$14=\"no deactivation\",\"CRS forbidden\",IF(J$14=\"no airbag\",\"N/A\",\"??\")))","v":"??"},"??","??","??","??",null,null,null,null,null,{"$f":"IF(T$12=\"Not available\",\"N/A\",IF(T$14=\"no deactivation\",\"CRS forbidden\",IF(T$14=\"no airbag\",\"N/A\",\"??\")))","v":"??"},"??"]
[null,null,"Universal Gabarit compatibility (ECE 16 only)",null,null,null,{"$f":"IF(G$12=\"Not available\",\"N/A\",\"??\")","v":"??"},{"$f":"IF(H$12=\"Not available\",\"N/A\",\"??\")","v":"??"},{"$f":"IF(I$12=\"Not available\",\"N/A\",\"??\")","v":"??"},"??","??","??","??","??",null,null,null,null,null,{"$f":"IF(T$12=\"Not available\",\"N/A\",\"??\")","v":"??"},{"$f":"IF(U$12=\"Not available\",\"N/A\",\"??\")","v":"??"}]
[null,null,"Universal Gabarit compatibility (with Euro NCAP additional requirements)",null,null,null,{"$f":"IF(G$12=\"Not available\",\"N/A\",IF(OR(G$36=\"No\",LEFT(G$36,6)=\"Restri\"),\"No\",\"??\"))","v":"??"},"??","??","??","??","??","??","??","means extra 150 mm belt length",null,null,null,null,{"$f":"IF(T$12=\"Not available\",\"N/A\",IF(OR(T$36=\"No\",LEFT(T$36,6)=\"Restri\"),\"No\",\"??\"))","v":"??"},{"$f":"IF(U$12=\"Not available\",\"N/A\",IF(OR(U$36=\"No\",LEFT(U$36,6)=\"Restri\"),\"No\",\"??\"))","v":"??"}]
[null,null,"Universal Gabarit compatibility - Specific vehicle seat adjustment need",null,null,null,{"$f":"IF(G$36=\"Yes\",\"??\",\"N/A\")","v":"N/A"},{"$f":"IF(H$36=\"Yes\",\"??\",\"N/A\")","v":"N/A"},"N/A","N/A","N/A","N/A","N/A","N/A","whenever the seat adjustment needs to differ from the by default adjustment defined by regulation to have compatibility, answer = \"needed\"",null,null,null,null,{"$f":"IF(T$36=\"Yes\",\"??\",\"N/A\")","v":"N/A"},"N/A"]
[null,null,"Universal Gabarit compatibility - additional info",null,null,null,{"$f":"IF(G$36=\"Yes\",\"??\",\"N/A\")","v":"N/A"},"N/A","N/A","N/A","N/A","N/A","N/A","N/A","if to be compatible there is a need to modify something else than the seat adjustment",null,null,null,null,{"$f":"IF(T$36=\"Yes\",\"??\",\"N/A\")","v":"N/A"},{"$f":"IF(U$36=\"Yes\",\"??\",\"N/A\")","v":"N/A"}]
[null,null,"i-Size homologation",null,null,null,{"$f":"IF(G$12=\"Not available\",\"N/A\",\"??\")","v":"??"},{"$f":"IF(H$12=\"Not available\",\"N/A\",\"??\")","v":"??"},{"$f":"IF(I$12=\"Not available\",\"N/A\",\"??\")","v":"??"},"??","??","??","??","??","presented as standard / optional / not available since the equipment may not be in std",null,null,null,null,{"$f":"IF(T$12=\"Not available\",\"N/A\",\"??\")","v":"??"},{"$f":"IF(U$12=\"Not available\",\"N/A\",\"??\")","v":"??"}]
[null,null,"Isofix homologation",null,"(not needed if i-Size already)",null,{"$f":"IF(G$40<>\"Not available\",G$40,\"??\")","v":"??"},{"$f":"IF(H$40<>\"Not available\",H$40,\"??\")","v":"??"},{"$f":"IF(I$40<>\"Not available\",I$40,\"??\")","v":"??"},"??","??","??","??","??","presented as standard / optional / not available since the equipment may not be in std",null,null,null,null,{"$f":"IF(T$40<>\"Not available\",T$40,\"??\")","v":"??"},{"$f":"IF(U$40<>\"Not available\",U$40,\"??\")","v":"??"}]
[null,null,"Location of top-tether anchorage",null,null,null,{"$f":"IF(G$12=\"Not available\",\"N/A\",IF(G$41=\"Not available\",\"N/A\",\"??\"))","v":"??"},"??","??","??","??","??","??","??",null,null,null,null,null,{"$f":"IF(T$12=\"Not available\",\"N/A\",IF(T$41=\"Not available\",\"N/A\",\"??\"))","v":"??"},{"$f":"IF(U$12=\"Not available\",\"N/A\",IF(U$41=\"Not available\",\"N/A\",\"??\"))","v":"??"}]
[null,null,"ISO/R3 compatibility",null,null,null,{"$f":"IF(AND(G$40=\"Not available\",G$41=\"Not available\"),\"N/A\",\"??\")","v":"??"},{"$f":"IF(AND(H$40=\"Not available\",H$41=\"Not available\"),\"N/A\",\"??\")","v":"??"},"??","??","??","??","??","??",null,null,null,null,null,{"$f":"IF(AND(T$40=\"Not available\",T$41=\"Not available\"),\"N/A\",\"??\")","v":"??"},{"$f":"IF(AND(U$40=\"Not available\",U$41=\"Not available\"),\"N/A\",\"??\")","v":"??"}]
[null,null,"ISO/R3 compatibility - Specific vehicle seat adjustment need",null,null,null,{"$f":"IF(G$43=\"Yes\",\"??\",\"N/A\")","v":"N/A"},{"$f":"IF(H$43=\"Yes\",\"??\",\"N/A\")","v":"N/A"},{"$f":"IF(I$43=\"Yes\",\"??\",\"N/A\")","v":"N/A"},"N/A","N/A","N/A","N/A","N/A","whenever the seat adjustment needs to differ from the by default adjustment defined by regulation to have compatibility, answer = \"needed\"",null,null,null,null,{"$f":"IF(T$43=\"Yes\",\"??\",\"N/A\")","v":"N/A"},{"$f":"IF(U$43=\"Yes\",\"??\",\"N/A\")","v":"N/A"}]
[null,null,"ISO/R2",null,"(=i-Size)",null,{"$f":"IF(AND(G$40=\"Not available\",G$41=\"Not available\"),\"N/A\",IF(G$43=\"Yes\",\"Yes\",\"??\"))","v":"??"},{"$f":"IF(AND(H$40=\"Not available\",H$41=\"Not available\"),\"N/A\",IF(H$43=\"Yes\",\"Yes\",\"??\"))","v":"??"},"??","??","??","??","??","??",null,null,null,null,null,{"$f":"IF(AND(T$40=\"Not available\",T$41=\"Not available\"),\"N/A\",IF(T$43=\"Yes\",\"Yes\",\"??\"))","v":"??"},"??"]
[null,null,"ISO/R1",null,null,null,{"$f":"IF(AND(G$40=\"Not available\",G$41=\"Not available\"),\"N/A\",IF(G$43=\"Yes\",\"Yes\",\"??\"))","v":"??"},"??","??","??","??","??","??","??",null,null,null,null,null,"??","??"]
[null,null,"ISO/F1",null,null,null,{"$f":"IF(AND(G$40=\"Not available\",G$41=\"Not available\"),\"N/A\",IF(G$43=\"Yes\",\"Yes\",\"??\"))","v":"??"},"??","??","??","??","??","??","??",null,null,null,null,null,"??","??"]
[null,null,"ISO/F2",null,null,null,{"$f":"IF(AND(G$40=\"Not available\",G$41=\"Not available\"),\"N/A\",IF(G$43=\"Yes\",\"Yes\",\"??\"))","v":"??"},"??","??","??","??","??","??","??",null,null,null,null,null,"??","??"]
[null,null,"ISO/F2X",null,"(=i-Size)",null,{"$f":"IF(AND(G$40=\"Not available\",G$41=\"Not available\"),\"N/A\",IF(G$43=\"Yes\",\"Yes\",\"??\"))","v":"??"},"??","??","??","??","??","??","??",null,null,null,null,null,"??","??"]
[null,null,"ISO/B2 compatibility when using belt only",null,null,null,{"$f":"IF(G$12=\"Not available\",\"N/A\",\"??\")","v":"??"},{"$f":"IF(H$12=\"Not available\",\"N/A\",\"??\")","v":"??"},{"$f":"IF(I$12=\"Not available\",\"N/A\",\"??\")","v":"??"},"??","??","??","??","??",null,null,null,null,null,{"$f":"IF(T$12=\"Not available\",\"N/A\",\"??\")","v":"??"},{"$f":"IF(U$12=\"Not available\",\"N/A\",\"??\")","v":"??"}]
[null,null,"ISO/B2 belt + Isofix compatibility",null,null,null,{"$f":"IF(AND(G$40=\"Not available\",G$41=\"Not available\"),\"N/A\",\"??\")","v":"??"},{"$f":"IF(AND(H$40=\"Not available\",H$41=\"Not available\"),\"N/A\",\"??\")","v":"??"},"??","??","??","??","??","??",null,null,null,null,null,{"$f":"IF(AND(T$40=\"Not available\",T$41=\"Not available\"),\"N/A\",\"??\")","v":"??"},{"$f":"IF(AND(U$40=\"Not available\",U$41=\"Not available\"),\"N/A\",\"??\")","v":"??"}]
[null,null,"ISO/B3 compatibility",null,null,null,{"$f":"IF(G$12=\"Not available\",\"N/A\",\"??\")","v":"??"},{"$f":"IF(H$12=\"Not available\",\"N/A\",\"??\")","v":"??"},"??","??","??","??","??","??",null,null,null,null,null,{"$f":"IF(T$12=\"Not available\",\"N/A\",\"??\")","v":"??"},"??"]
[null,null,"Lower-tether anchorage",null,"(provide instructions where to find them)",null,{"$f":"IF(G$12=\"Not available\",\"N/A\",\"??\")","v":"??"},{"$f":"IF(H$12=\"Not available\",\"N/A\",\"??\")","v":"??"},"??","??","??","??","??","??",null,null,null,null,null,{"$f":"IF(T$12=\"Not available\",\"N/A\",\"??\")","v":"??"},"??"]
[null,null,"Support leg compatibility",null,"(apart from i-Size homologation)",null,{"$f":"IF(G$12=\"Not available\",\"N/A\",\"??\")","v":"??"},"??","??","??","??","??","??","??","when homologated for i-Size, the floor is judged compatible for support leg. But if the support leg is not i-Size, there may be other problems. Recommendation in case of iSize homologation to always write Check CRS vehicle List to cover the Isofix CRS",null,null,null,null,"??","??"]
[null,null,"Support leg possible incompatibility reason",null,null,null,{"$f":"IF(G$12=\"Not available\",\"N/A\",\"??\")","v":"??"},"??","??","??","??","??","??","??",null,null,null,null,null,{"$f":"IF(T$12=\"Not available\",\"N/A\",\"??\")","v":"??"},{"$f":"IF(U$12=\"Not available\",\"N/A\",\"??\")","v":"??"}]

{"sheet":"VRU Headform","index":13,"n_rows":75,"n_cols":47,"rows_kept":75,"cut":false,"hidden":false,"merged":[[72,3,72,18],[70,19,70,24],[71,19,71,24],[72,19,72,24],[68,1,68,18],[68,19,68,24],[74,1,74,18],[74,19,74,24],[66,1,66,2],[66,3,66,18],[66,19,66,24],[67,1,67,2],[67,3,67,18],[67,19,67,24],[70,1,70,2],[70,3,70,18],[71,1,71,2],[71,3,71,18],[72,1,72,2],[73,19,73,24],[62,1,62,18],[62,19,62,24],[64,1,64,18],[64,19,64,24],[61,1,61,2],[61,3,61,5],[61,6,61,8],[61,9,61,11],[65,1,65,2],[65,3,65,18],[65,19,65,24],[60,19,60,21],[60,22,60,24],[59,1,59,2],[59,3,59,5],[59,6,59,8],[59,9,59,11],[59,13,59,15],[59,16,59,18],[61,13,61,15],[61,16,61,18],[59,19,59,21],[59,22,59,24],[60,1,60,2],[60,3,60,5],[60,6,60,8],[60,9,60,11],[60,13,60,15],[60,16,60,18],[61,19,61,21],[61,22,61,24],[57,1,57,2],[57,3,57,5],[57,6,57,8],[57,9,57,11],[57,13,57,15],[57,16,57,18],[57,19,57,21],[57,22,57,24],[58,1,58,2],[58,3,58,5],[58,6,58,8],[58,9,58,11],[58,13,58,15],[58,16,58,18],[58,19,58,21],[58,22,58,24],[55,1,55,2],[55,3,55,5],[55,6,55,8],[55,9,55,11],[55,13,55,15],[55,16,55,18],[55,19,55,21],[55,22,55,24],[56,1,56,2],[56,3,56,5],[56,6,56,8],[56,9,56,11],[56,13,56,15],[56,16,56,18],[56,19,56,21],[56,22,56,24],[53,1,53,2],[53,3,53,5],[53,6,53,8],[53,9,53,11],[53,13,53,15],[53,16,53,18],[53,19,53,21],[53,22,53,24],[54,1,54,2],[54,3,54,5],[54,6,54,8],[54,9,54,11],[54,13,54,15],[54,16,54,18],[54,19,54,21],[54,22,54,24],[51,1,51,24],[52,1,52,2],[52,3,52,5],[52,6,52,8],[52,9,52,11],[52,13,52,15],[52,16,52,18],[52,19,52,21],[52,22,52,24],[47,1,47,2],[47,3,47,5],[47,6,47,8],[47,9,47,11],[47,13,47,15],[47,16,47,18],[47,19,47,21],[47,22,47,24],[49,1,49,18],[49,19,49,24],[45,1,45,2],[45,3,45,5],[45,6,45,8],[45,9,45,11],[45,13,45,15],[45,16,45,18],[45,19,45,21],[45,22,45,24],[46,1,46,2],[46,3,46,5],[46,6,46,8],[46,9,46,11],[46,13,46,15],[46,16,46,18],[46,19,46,21],[46,22,46,24],[43,1,43,2],[43,3,43,5],[43,6,43,8],[43,9,43,11],[43,13,43,15],[43,16,43,18],[43,19,43,21],[43,22,43,24],[44,1,44,2],[44,3,44,5],[44,6,44,8],[44,9,44,11],[44,13,44,15],[44,16,44,18],[44,19,44,21],[44,22,44,24],[41,1,41,2],[41,3,41,5],[41,6,41,8],[41,9,41,11],[41,13,41,15],[41,16,41,18],[41,19,41,21],[41,22,41,24],[42,1,42,2],[42,3,42,5],[42,6,42,8],[42,9,42,11],[42,13,42,15],[42,16,42,18],[42,19,42,21],[42,22,42,24],[39,1,39,2],[39,3,39,5],[39,6,39,8],[39,9,39,11],[39,13,39,15],[39,16,39,18],[39,19,39,21],[39,22,39,24],[40,1,40,2],[40,3,40,5],[40,6,40,8],[40,9,40,11],[40,13,40,15],[40,16,40,18],[40,19,40,21],[40,22,40,24],[37,1,37,2],[37,3,37,5],[37,6,37,8],[37,9,37,11],[37,13,37,15],[37,16,37,18],[37,19,37,21],[37,22,37,24],[38,1,38,2],[38,3,38,5],[38,6,38,8],[38,9,38,11],[38,13,38,15],[38,16,38,18],[38,19,38,21],[38,22,38,24],[33,1,33,15],[33,16,33,18],[33,19,33,21],[33,22,33,24],[35,1,35,24],[36,1,36,2],[36,3,36,5],[36,6,36,8],[36,9,36,11],[36,13,36,15],[36,16,36,18],[36,19,36,21],[36,22,36,24],[31,1,31,3],[31,4,31,15],[31,16,31,18],[31,19,31,21],[31,22,31,24],[32,1,32,3],[32,4,32,15],[32,16,32,18],[32,19,32,21],[32,22,32,24],[29,1,29,3],[29,4,29,15],[29,16,29,18],[29,19,29,21],[29,22,29,24],[30,1,30,3],[30,4,30,15],[30,16,30,18],[30,19,30,21],[30,22,30,24],[27,1,27,3],[27,4,27,15],[27,16,27,18],[27,19,27,21],[27,22,27,24],[28,1,28,3],[28,4,28,15],[28,16,28,18],[28,19,28,21],[28,22,28,24],[26,1,26,3],[26,4,26,15],[26,16,26,18],[26,19,26,21],[26,22,26,24],[25,4,25,15],[25,16,25,18],[25,19,25,21],[25,22,25,24],[15,25,16,26],[15,29,16,29],[4,25,10,25],[11,25,14,25],[1,1,2,24],[3,1,3,3],[4,1,22,1],[24,1,24,3],[24,4,24,15],[24,16,24,18],[24,19,24,21],[24,22,24,24],[17,25,22,25]]}
[null,null,null,null,null,null,null,null,null,null,null,null,null,null,null,null,null,null,null,null,null,null,null,null,null,null,null,null,null,null,null,null,null,null,null,null,null,null,null,null,null,false,"Cell","value","adult","child"]
[null,"VRU Headforms",null,null,null,null,null,null,null,null,null,null,null,null,null,null,null,null,null,null,null,null,null,null,null,null,null,null,null,null,null,null,null,null,null,null,null,null,null,null,null,false,"E16",{"$f":"INDIRECT(AQ2)","v":0},{"$f":"AR2","v":0},null,{"$f":"IF(OR(AND(AS2:AT2=\"\"),NOT(OR(AR2=AS2:AT2))),\"Error\",\"\")","v":""}]
[null,null,null,null,null,null,null,null,null,null,null,null,null,null,null,null,null,null,null,null,null,null,null,null,null,null,null,null,null,null,null,null,null,null,null,null,null,null,null,null,null,null,"F16",{"$f":"INDIRECT(AQ3)","v":0},null,{"$f":"AR3","v":0},{"$f":"IF(OR(AND(AS3:AT3=\"\"),NOT(OR(AR3=AS3:AT3))),\"Error\",\"\")","v":""}]
[null,null,null,null,10,9,8,7,6,5,4,3,2,1,0,-1,-2,-3,-4,-5,-6,-7,-8,-9,-10,null,null,null,null,null,null,null,null,null,null,null,null,null,null,null,null,null,"G16",{"$f":"INDIRECT(AQ4)","v":0},0,null,{"$f":"IF(OR(AND(AS4:AT4=\"\"),NOT(OR(AR4=AS4:AT4))),\"Error\",\"\")","v":""}]
[null,"WAD on Centreline",2800,18,null,null,null,null,null,null,null,null,null,null,null,null,null,null,null,null,null,null,null,null,null,"Cyclist",null,null,null,null,null,null,null,null,null,null,null,null,null,null,null,null,"H16",{"$f":"INDIRECT(AQ5)","v":0},0,null,{"$f":"IF(OR(AND(AS5:AT5=\"\"),NOT(OR(AR5=AS5:AT5))),\"Error\",\"\")","v":""}]
[null,null,2700,17,null,null,null,null,null,null,null,null,null,null,null,null,null,null,null,null,null,null,null,null,null,null,null,null,null,null,null,null,null,null,null,null,null,null,null,null,null,null,"I16",{"$f":"INDIRECT(AQ6)","v":0},0]
[null,null,2600,16,null,null,null,null,null,null,null,null,null,null,null,null,null,null,null,null,null,null,null,null,null,null,null,null,null,null,null,null,null,null,null,null,null,null,null,null,null,null,"J16",{"$f":"INDIRECT(AQ7)","v":0},0]
[null,null,2500,15,null,null,null,null,null,null,null,null,null,null,null,null,null,null,null,null,null,null,null,null,null,null,null,null,null,null,null,null,null,null,null,null,null,null,null,null,null,null,"K16",{"$f":"INDIRECT(AQ8)","v":0},0,null,{"$f":"IF(OR(AND(AS6:AT6=\"\"),NOT(OR(AR6=AS6:AT6))),\"Error\",\"\")","v":""}]
[null,null,2400,14,null,null,null,null,null,null,null,null,null,null,null,null,null,null,null,null,null,null,null,null,null,null,null,null,null,null,null,null,null,null,null,null,null,null,null,null,null,null,"L16",{"$f":"INDIRECT(AQ9)","v":0},null,{"$f":"AR9","v":0},{"$f":"IF(OR(AND(AS7:AT7=\"\"),NOT(OR(AR7=AS7:AT7))),\"Error\",\"\")","v":""}]
[null,null,2300,13,null,null,null,null,null,null,null,null,null,null,null,null,null,null,null,null,null,null,null,null,null,null,null,null,null,null,null,null,null,null,null,null,null,null,null,null,null,null,"M16",{"$f":"INDIRECT(AQ10)","v":0},null,0,{"$f":"IF(OR(AND(AS8:AT8=\"\"),NOT(OR(AR8=AS8:AT8))),\"Error\",\"\")","v":""}]
[null,null,2200,12,null,null,null,null,null,null,null,null,null,null,null,null,null,null,null,null,null,null,null,null,null,null,null,null,null,null,null,null,null,null,null,null,null,null,null,null,null,null,"N16",{"$f":"INDIRECT(AQ11)","v":0},null,0,{"$f":"IF(OR(AND(AS9:AT9=\"\"),NOT(OR(AR9=AS9:AT9))),\"Error\",\"\")","v":""}]
[null,null,2100,11,null,null,null,null,null,null,null,null,null,null,null,null,null,null,null,null,null,null,null,null,null,"Adult",null,null,null,null,null,null,null,null,null,null,null,null,null,null,null,null,"O16",{"$f":"INDIRECT(AQ12)","v":0},null,0,{"$f":"IF(OR(AND(AS10:AT10=\"\"),NOT(OR(AR10=AS10:AT10))),\"Error\",\"\")","v":""}]
[null,null,2000,10,null,null,null,null,null,null,null,null,null,null,null,null,null,null,null,null,null,null,null,null,null,null,null,null,null,null,null,null,null,null,null,null,null,null,null,null,null,null,"P16",{"$f":"INDIRECT(AQ13)","v":0},null,0,{"$f":"IF(OR(AND(AS11:AT11=\"\"),NOT(OR(AR11=AS11:AT11))),\"Error\",\"\")","v":""}]
[null,null,1900,9,null,null,null,null,null,null,null,null,null,null,null,null,null,null,null,null,null,null,null,null,null,null,null,null,null,null,null,null,null,null,null,null,null,null,null,null,null,null,"Q16",{"$f":"INDIRECT(AQ14)","v":0},null,0,{"$f":"IF(OR(AND(AS12:AT12=\"\"),NOT(OR(AR12=AS12:AT12))),\"Error\",\"\")","v":""}]
[null,null,1800,8,null,null,null,null,null,null,null,null,null,null,null,null,null,null,null,null,null,null,null,null,null,null,null,null,null,null,null,null,null,null,null,null,null,null,null,null,null,null,"R16",{"$f":"INDIRECT(AQ15)","v":0},null,0,{"$f":"IF(OR(AND(AS13:AT13=\"\"),NOT(OR(AR13=AS13:AT13))),\"Error\",\"\")","v":""}]
[null,null,1700,7,null,null,null,null,null,null,null,null,null,null,null,null,null,null,null,null,null,null,null,null,null,"Select Cells then",null,null,null,"or",null,null,null,null,null,null,null,null,null,null,null,null,"S16",{"$f":"INDIRECT(AQ16)","v":0},null,0,{"$f":"IF(OR(AND(AS14:AT14=\"\"),NOT(OR(AR14=AS14:AT14))),\"Error\",\"\")","v":""}]
[null,null,1600,6,null,null,null,null,null,null,null,null,null,null,null,null,null,null,null,null,null,null,null,null,null,null,null,null,null,null,null,null,null,null,null,null,null,null,null,null,null,null,"T16",{"$f":"INDIRECT(AQ17)","v":0},0,null,{"$f":"IF(OR(AND(AS15:AT15=\"\"),NOT(OR(AR15=AS15:AT15))),\"Error\",\"\")","v":""}]
[null,null,1500,5,null,null,null,null,null,null,null,null,null,null,null,null,null,null,null,null,null,null,null,null,null,"Child\nsmall adult",null,null,null,null,null,null,null,null,null,null,null,null,null,null,null,null,"U16",{"$f":"INDIRECT(AQ18)","v":0},0,null,{"$f":"IF(OR(AND(AS16:AT16=\"\"),NOT(OR(AR16=AS16:AT16))),\"Error\",\"\")","v":""}]
[null,null,1400,4,null,null,null,null,null,null,null,null,null,null,null,null,null,null,null,null,null,null,null,null,null,null,null,null,null,null,null,null,null,null,null,null,null,null,null,null,null,null,"V16",{"$f":"INDIRECT(AQ19)","v":0},0,null,{"$f":"IF(OR(AND(AS17:AT17=\"\"),NOT(OR(AR17=AS17:AT17))),\"Error\",\"\")","v":""}]
[null,null,1300,3,null,null,null,null,null,null,null,null,null,null,null,null,null,null,null,null,null,null,null,null,null,null,null,null,null,null,null,null,null,null,null,null,null,null,null,null,null,null,"W16",{"$f":"INDIRECT(AQ20)","v":0},0,null,{"$f":"IF(OR(AND(AS18:AT18=\"\"),NOT(OR(AR18=AS18:AT18))),\"Error\",\"\")","v":""}]
[null,null,1200,2,null,null,null,null,null,null,null,null,null,null,null,null,null,null,null,null,null,null,null,null,null,null,null,null,null,null,null,null,null,null,null,null,null,null,null,null,null,null,"X16",{"$f":"INDIRECT(AQ21)","v":0},0,null,{"$f":"IF(OR(AND(AS19:AT19=\"\"),NOT(OR(AR19=AS19:AT19))),\"Error\",\"\")","v":""}]
[null,null,1100,1,null,null,null,null,null,null,null,null,null,null,null,null,null,null,null,null,null,null,null,null,null,null,null,null,null,null,null,null,null,null,null,null,null,null,null,null,null,null,"Y16",{"$f":"INDIRECT(AQ22)","v":0},0,null,{"$f":"IF(OR(AND(AS20:AT20=\"\"),NOT(OR(AR20=AS20:AT20))),\"Error\",\"\")","v":""}]
[null,null,1000,0,null,null,null,null,null,null,null,null,null,null,null,null,null,null,null,null,null,null,null,null,null,null,null,null,null,null,null,null,null,null,null,null,null,null,null,null,null,null,"E17",{"$f":"INDIRECT(AQ23)","v":0},null,{"$f":"AR23","v":0},{"$f":"IF(OR(AND(AS21:AT21=\"\"),NOT(OR(AR21=AS21:AT21))),\"Error\",\"\")","v":""}]
[null,null,null,null,null,null,null,null,null,null,null,null,null,null,null,null,null,null,null,null,null,null,null,null,null,null,null,null,null,null,null,null,null,null,null,null,null,null,null,null,null,null,"F17",{"$f":"INDIRECT(AQ24)","v":0},null,0,{"$f":"IF(OR(AND(AS22:AT22=\"\"),NOT(OR(AR22=AS22:AT22))),\"Error\",\"\")","v":""}]
[null,"PREDICTION",null,null,null,null,null,null,null,null,null,null,null,null,null,null,"Nr of points",null,null,"Points",null,null,"%-age",null,null,null,null,null,null,null,null,null,null,null,null,null,null,null,null,null,null,null,"G17",{"$f":"INDIRECT(AQ25)","v":0},null,0,{"$f":"IF(OR(AND(AS23:AT23=\"\"),NOT(OR(AR23=AS23:AT23))),\"Error\",\"\")","v":""}]
[null,null,null,null,"D Green",null,null,null,null,null,null,null,null,null,null,null,{"$f":"COUNTIF($E$5:$Y$23,\"D Green\")","v":0},null,null,{"$f":"Q26*1","v":0},null,null,{"$f":"IF(COUNTBLANK(E4:Y22)>0,\"\",Q26/$Q$34)","v":""},null,null,null,null,null,null,null,null,null,null,null,null,null,null,null,null,null,null,null,"H17",{"$f":"INDIRECT(AQ26)","v":0},null,0,{"$f":"IF(OR(AND(AS24:AT24=\"\"),NOT(OR(AR24=AS24:AT24))),\"Error\",\"\")","v":""}]
[null,null,null,null,"Green",null,null,null,null,null,null,null,null,null,null,null,{"$f":"COUNTIF($E$5:$Y$23,\"Green\")","v":0},null,null,{"$f":"Q27*1","v":0},null,null,{"$f":"IF(COUNTBLANK(E5:Y23)>0,\"\",Q27/$Q$34)","v":""},null,null,null,null,null,null,null,null,null,null,null,null,null,null,null,null,null,null,null,"I17",{"$f":"INDIRECT(AQ27)","v":0},null,0,{"$f":"IF(OR(AND(AS25:AT25=\"\"),NOT(OR(AR25=AS25:AT25))),\"Error\",\"\")","v":""}]
[null,null,null,null,"Yellow",null,null,null,null,null,null,null,null,null,null,null,{"$f":"COUNTIF($E$5:$Y$23,\"Yellow\")","v":0},null,null,{"$f":"Q28*0.75","v":0},null,null,{"$f":"IF(COUNTBLANK(E5:Y23)>0,\"\",Q28/$Q$34)","v":""},null,null,null,null,null,null,null,null,null,null,null,null,null,null,null,null,null,null,null,"J17",{"$f":"INDIRECT(AQ28)","v":0},null,0,{"$f":"IF(OR(AND(AS26:AT26=\"\"),NOT(OR(AR26=AS26:AT26))),\"Error\",\"\")","v":""}]
[null,null,null,null,"Orange",null,null,null,null,null,null,null,null,null,null,null,{"$f":"COUNTIF($E$5:$Y$23,\"Orange\")","v":0},null,null,{"$f":"Q29*0.5","v":0},null,null,{"$f":"IF(COUNTBLANK(E5:Y23)>0,\"\",Q29/$Q$34)","v":""},null,null,null,null,null,null,null,null,null,null,null,null,null,null,null,null,null,null,null,"K17",{"$f":"INDIRECT(AQ29)","v":0},null,0,{"$f":"IF(OR(AND(AS27:AT27=\"\"),NOT(OR(AR27=AS27:AT27))),\"Error\",\"\")","v":""}]
[null,null,null,null,"Brown",null,null,null,null,null,null,null,null,null,null,null,{"$f":"COUNTIF($E$5:$Y$23,\"Brown\")","v":0},null,null,{"$f":"Q30*0.25","v":0},null,null,{"$f":"IF(COUNTBLANK(E5:Y23)>0,\"\",Q30/$Q$34)","v":""},null,null,null,null,null,null,null,null,null,null,null,null,null,null,null,null,null,null,null,"L17",{"$f":"INDIRECT(AQ30)","v":0},null,0,{"$f":"IF(OR(AND(AS28:AT28=\"\"),NOT(OR(AR28=AS28:AT28))),\"Error\",\"\")","v":""}]
[null,null,null,null,"Red",null,null,null,null,null,null,null,null,null,null,null,{"$f":"COUNTIF($E$5:$Y$23,\"Red\")","v":0},null,null,{"$f":"Q31*0","v":0},null,null,{"$f":"IF(COUNTBLANK(E5:Y23)>0,\"\",Q31/$Q$34)","v":""},null,null,null,null,null,null,null,null,null,null,null,null,null,null,null,null,null,null,null,"M17",{"$f":"INDIRECT(AQ31)","v":0},null,0,{"$f":"IF(OR(AND(AS29:AT29=\"\"),NOT(OR(AR29=AS29:AT29))),\"Error\",\"\")","v":""}]
[null,null,null,null,"Default Red",null,null,null,null,null,null,null,null,null,null,null,{"$f":"COUNTIF($E$5:$Y$23,\"D Red\")","v":0},null,null,{"$f":"Q32*0","v":0},null,null,{"$f":"IF(COUNTBLANK(E5:Y23)>0,\"\",Q32/$Q$34)","v":""},null,null,null,null,null,null,null,null,null,null,null,null,null,null,null,null,null,null,null,"N17",{"$f":"INDIRECT(AQ32)","v":0},{"$f":"AR32","v":0},null,{"$f":"IF(OR(AND(AS30:AT30=\"\"),NOT(OR(AR30=AS30:AT30))),\"Error\",\"\")","v":""}]
[null,null,null,null,"Blue",null,null,null,null,null,null,null,null,null,null,null,{"$f":"COUNTIF($E$5:$Y$23,\"Blue\")","v":0},null,null,null,null,null,{"$f":"IF(COUNTBLANK(E5:Y23)>0,\"\",Q33/$Q$34)","v":""},null,null,null,null,null,null,null,null,null,null,null,null,null,null,null,null,null,null,null,"O17",{"$f":"INDIRECT(AQ33)","v":0},{"$f":"AR33","v":0},null,{"$f":"IF(OR(AND(AS31:AT31=\"\"),NOT(OR(AR31=AS31:AT31))),\"Error\",\"\")","v":""}]
[null,"Predicted headform score (excluding blue points)",null,null,null,null,null,null,null,null,null,null,null,null,null,null,{"$f":"SUM(Q26:S33)","v":0},null,null,{"$f":"SUM(T26:V32)","v":0},null,null,{"$f":"SUM(W26:Y33)","v":0},null,null,null,null,null,null,null,null,null,null,null,null,null,null,null,null,null,null,null,"P17",{"$f":"INDIRECT(AQ34)","v":0},{"$f":"AR34","v":0},null,{"$f":"IF(OR(AND(AS32:AT32=\"\"),NOT(OR(AR32=AS32:AT32))),\"Error\",\"\")","v":""}]
[null,null,null,null,null,null,null,null,null,null,null,null,null,null,null,null,null,null,null,null,null,null,null,null,null,null,null,null,null,null,null,null,null,null,null,null,null,null,null,null,null,null,"Q17",{"$f":"INDIRECT(AQ35)","v":0},{"$f":"AR35","v":0},null,{"$f":"IF(OR(AND(AS33:AT33=\"\"),NOT(OR(AR33=AS33:AT33))),\"Error\",\"\")","v":""}]
[null,"VERIFICATION",null,null,null,null,null,null,null,null,null,null,null,null,null,null,null,null,null,null,null,null,null,null,null,null,null,null,null,null,null,null,null,null,null,null,null,null,null,null,null,null,"R17",{"$f":"INDIRECT(AQ36)","v":0},null,0,{"$f":"IF(OR(AND(AS34:AT34=\"\"),NOT(OR(AR34=AS34:AT34))),\"Error\",\"\")","v":""}]
[null,"Testpoint",null,"Prediction",null,null,"Value",null,null,"Points",null,null,null,"Testpoint",null,null,"Prediction",null,null,"Value",null,null,"Points",null,null,null,null,null,null,null,null,null,null,null,null,null,null,null,null,null,null,null,"S17",{"$f":"INDIRECT(AQ37)","v":0},null,0,{"$f":"IF(OR(AND(AS35:AT35=\"\"),NOT(OR(AR35=AS35:AT35))),\"Error\",\"\")","v":""}]
[null,null,null,null,null,null,null,null,null,{"$f":"IF(G38=\"\",\"\",actual_score(G38,D38))","v":""},null,null,null,null,null,null,null,null,null,null,null,null,{"$f":"IF(T38=\"\",\"\",actual_score(T38,Q38))","v":""},null,null,null,null,null,null,null,null,null,null,null,null,null,null,null,null,null,null,null,"T17",{"$f":"INDIRECT(AQ38)","v":0},null,0,{"$f":"IF(OR(AND(AS36:AT36=\"\"),NOT(OR(AR36=AS36:AT36))),\"Error\",\"\")","v":""}]
[null,null,null,null,null,null,null,null,null,{"$f":"IF(G39=\"\",\"\",actual_score(G39,D39))","v":""},null,null,null,null,null,null,null,null,null,null,null,null,"",null,null,null,null,null,null,null,null,null,null,null,null,null,null,null,null,null,null,null,"U17",{"$f":"INDIRECT(AQ39)","v":0},null,0,{"$f":"IF(OR(AND(AS37:AT37=\"\"),NOT(OR(AR37=AS37:AT37))),\"Error\",\"\")","v":""}]
[null,null,null,null,null,null,null,null,null,"",null,null,null,null,null,null,null,null,null,null,null,null,"",null,null,null,null,null,null,null,null,null,null,null,null,null,null,null,null,null,null,null,"V17",{"$f":"INDIRECT(AQ40)","v":0},null,0,{"$f":"IF(OR(AND(AS38:AT38=\"\"),NOT(OR(AR38=AS38:AT38))),\"Error\",\"\")","v":""}]
[null,null,null,null,null,null,null,null,null,"",null,null,null,null,null,null,null,null,null,null,null,null,"",null,null,null,null,null,null,null,null,null,null,null,null,null,null,null,null,null,null,null,"W17",{"$f":"INDIRECT(AQ41)","v":0},null,0,{"$f":"IF(OR(AND(AS39:AT39=\"\"),NOT(OR(AR39=AS39:AT39))),\"Error\",\"\")","v":""}]
[null,null,null,null,null,null,null,null,null,"",null,null,null,null,null,null,null,null,null,null,null,null,"",null,null,null,null,null,null,null,null,null,null,null,null,null,null,null,null,null,null,null,"X17",{"$f":"INDIRECT(AQ42)","v":0},null,0,{"$f":"IF(OR(AND(AS40:AT40=\"\"),NOT(OR(AR40=AS40:AT40))),\"Error\",\"\")","v":""}]
[null,null,null,null,null,null,null,null,null,"",null,null,null,null,null,null,null,null,null,null,null,null,"",null,null,null,null,null,null,null,null,null,null,null,null,null,null,null,null,null,null,null,"Y17",{"$f":"INDIRECT(AQ43)","v":0},null,0,{"$f":"IF(OR(AND(AS41:AT41=\"\"),NOT(OR(AR41=AS41:AT41))),\"Error\",\"\")","v":""}]
[null,null,null,null,null,null,null,null,null,"",null,null,null,null,null,null,null,null,null,null,null,null,"",null,null,null,null,null,null,null,null,null,null,null,null,null,null,null,null,null,null,null,null,null,null,null,{"$f":"IF(OR(AND(AS42:AT42=\"\"),NOT(OR(AR42=AS42:AT42))),\"Error\",\"\")","v":""}]
[null,null,null,null,null,null,null,null,null,"",null,null,null,null,null,null,null,null,null,null,null,null,"",null,null,null,null,null,null,null,null,null,null,null,null,null,null,null,null,null,null,null,null,null,null,null,{"$f":"IF(OR(AND(AS43:AT43=\"\"),NOT(OR(AR43=AS43:AT43))),\"Error\",\"\")","v":""}]
[null,null,null,null,null,null,null,null,null,"",null,null,null,null,null,null,null,null,null,null,null,null,""]
[null,null,null,null,null,null,null,null,null,"",null,null,null,null,null,null,null,null,null,null,null,null,""]
[null,"Total",null,{"$f":"(COUNTIF(D38:F47,\"Green\")*1)+(COUNTIF(D38:F47,\"Yellow\")*0.75)+(COUNTIF(D38:F47,\"Orange\")*0.5)+(COUNTIF(D38:F47,\"Brown\")*0.25)","v":0},null,null,null,null,null,{"$f":"SUM(J38:L47)","v":0},null,null,null,"Total",null,null,{"$f":"(COUNTIF(Q38:S47,\"Green\")*1)+(COUNTIF(Q38:S47,\"Yellow\")*0.75)+(COUNTIF(Q38:S47,\"Orange\")*0.5)+(COUNTIF(Q38:S47,\"Brown\")*0.25)","v":0},null,null,null,null,null,{"$f":"SUM(W38:Y47)","v":0}]
[]
[null,"Correction factor",null,null,null,null,null,null,null,null,null,null,null,null,null,null,null,null,null,{"$f":"ROUND(IF((J48+W48)=0,1,(J48+W48)/(D48+Q48)),Round)","v":1}]
[]
[null,"BLUE POINTS"]
[null,"Zone",null,"GRID-point",null,null,"Value",null,null,"Points",null,null,null,"Zone",null,null,"GRID-point",null,null,"Value",null,null,"Points"]
[null,1,null,null,null,null,null,null,null,{"$f":"IF(G54=\"\",\"\",IF(G54<=650,1,IF(G54<=1000,0.75,IF(G54<=1350,0.5,IF(G54<=1700,0.25,0)))))","v":""},null,null,null,5,null,null,null,null,null,null,null,null,{"$f":"IF(T54=\"\",\"\",IF(T54<=650,1,IF(T54<=1000,0.75,IF(T54<=1350,0.5,IF(T54<=1700,0.25,0)))))","v":""}]
[null,null,null,null,null,null,null,null,null,{"$f":"IF(D55=\"\",\"\",IF(G54<=650,1,IF(G54<=1000,0.75,IF(G54<=1350,0.5,IF(G54<=1700,0.25,0)))))","v":""},null,null,null,null,null,null,null,null,null,null,null,null,{"$f":"IF(Q55=\"\",\"\",IF(T54<=650,1,IF(T54<=1000,0.75,IF(T54<=1350,0.5,IF(T54<=1700,0.25,0)))))","v":""}]
[null,2,null,null,null,null,null,null,null,{"$f":"IF(G56=\"\",\"\",IF(G56<=650,1,IF(G56<=1000,0.75,IF(G56<=1350,0.5,IF(G56<=1700,0.25,0)))))","v":""},null,null,null,6,null,null,null,null,null,null,null,null,{"$f":"IF(T56=\"\",\"\",IF(T56<=650,1,IF(T56<=1000,0.75,IF(T56<=1350,0.5,IF(T56<=1700,0.25,0)))))","v":""}]
[null,null,null,null,null,null,null,null,null,{"$f":"IF(D57=\"\",\"\",IF(G56<=650,1,IF(G56<=1000,0.75,IF(G56<=1350,0.5,IF(G56<=1700,0.25,0)))))","v":""},null,null,null,null,null,null,null,null,null,null,null,null,{"$f":"IF(Q57=\"\",\"\",IF(T56<=650,1,IF(T56<=1000,0.75,IF(T56<=1350,0.5,IF(T56<=1700,0.25,0)))))","v":""}]
[null,3,null,null,null,null,null,null,null,{"$f":"IF(G58=\"\",\"\",IF(G58<=650,1,IF(G58<=1000,0.75,IF(G58<=1350,0.5,IF(G58<=1700,0.25,0)))))","v":""},null,null,null,7,null,null,null,null,null,null,null,null,{"$f":"IF(T58=\"\",\"\",IF(T58<=650,1,IF(T58<=1000,0.75,IF(T58<=1350,0.5,IF(T58<=1700,0.25,0)))))","v":""}]
[null,null,null,null,null,null,null,null,null,{"$f":"IF(D59=\"\",\"\",IF(G58<=650,1,IF(G58<=1000,0.75,IF(G58<=1350,0.5,IF(G58<=1700,0.25,0)))))","v":""},null,null,null,null,null,null,null,null,null,null,null,null,{"$f":"IF(Q59=\"\",\"\",IF(T58<=650,1,IF(T58<=1000,0.75,IF(T58<=1350,0.5,IF(T58<=1700,0.25,0)))))","v":""}]
[null,4,null,null,null,null,null,null,null,{"$f":"IF(G60=\"\",\"\",IF(G60<=650,1,IF(G60<=1000,0.75,IF(G60<=1350,0.5,IF(G60<=1700,0.25,0)))))","v":""},null,null,null,8,null,null,null,null,null,null,null,null,{"$f":"IF(T60=\"\",\"\",IF(T60<=650,1,IF(T60<=1000,0.75,IF(T60<=1350,0.5,IF(T60<=1700,0.25,0)))))","v":""}]
[null,null,null,null,null,null,null,null,null,{"$f":"IF(D61=\"\",\"\",IF(G60<=650,1,IF(G60<=1000,0.75,IF(G60<=1350,0.5,IF(G60<=1700,0.25,0)))))","v":""},null,null,null,null,null,null,null,null,null,null,null,null,{"$f":"IF(Q61=\"\",\"\",IF(T60<=650,1,IF(T60<=1000,0.75,IF(T60<=1350,0.5,IF(T60<=1700,0.25,0)))))","v":""}]
[]
[null,"Total blue points",null,null,null,null,null,null,null,null,null,null,null,null,null,null,null,null,null,{"$f":"SUM(J54:L61,W54:Y61)","v":0}]
[]
[null,"SUMMARY"]
[null,null,null,"Predicted score (excluding blue points)",null,null,null,null,null,null,null,null,null,null,null,null,null,null,null,{"$f":"T34","v":0}]
[null,null,null,"Blue points score",null,null,null,null,null,null,null,null,null,null,null,null,null,null,null,{"$f":"T63","v":0}]
[null,null,null,"Correction factor",null,null,null,null,null,null,null,null,null,null,null,null,null,null,null,{"$f":"T50","v":1}]
[null,"Total score",null,null,null,null,null,null,null,null,null,null,null,null,null,null,null,null,null,{"$f":"IF(T68=\"\",\"\",ROUND((T66)*T68+T67,Round))","v":0}]
[]
[null,null,null,"Cyclist headform zone star cap?",null,null,null,null,null,null,null,null,null,null,null,null,null,null,null,{"$f":"IF(COUNTIF(cyclist,\"<>*N/A\")=COUNTIF(cyclist,\"=*red*\"),\"Star Cap\",\"No\")","v":"No"}]
[null,null,null,"Adult headform zone star cap?",null,null,null,null,null,null,null,null,null,null,null,null,null,null,null,{"$f":"IF(AND(COUNTIF(adult,\"<>*N/A\")=COUNTIF(adult,\"=*red*\"),COUNTA(BRRL_adult)=COUNTIF(BRRL_adult,\"=*red*\")),\"Star Cap\",\"No\")","v":"No"}]
[null,null,null,"Child headfrom zone star cap?",null,null,null,null,null,null,null,null,null,null,null,null,null,null,null,{"$f":"IF(AND(COUNTIF(child,\"<>*N/A\")=COUNTIF(child,\"=*red*\"),COUNTA(BRRL_child)=COUNTIF(BRRL_child,\"=*red*\")),\"Star Cap\",\"No\")","v":"No"}]
[null,null,null,null,null,null,null,null,null,null,null,null,null,null,null,null,null,null,null,{"$f":"IF(OR(T71=\"Star Cap\",T72=\"Star Cap\",T73=\"Star Cap\",'VRU Upper Legform'!G35=0,'VRU Legform'!E32=0,'VRU Legform'!E36=0),TRUE,FALSE)","v":true},null,null,null,null,null,{"$f":"ROUND(T75,1)","v":0}]
[null,"TOTAL VRU HEADFORM",null,null,null,null,null,null,null,null,null,null,null,null,null,null,null,null,null,{"$f":"IF(COUNTBLANK(E5:Y23)>0,0,ROUND(T69/Q34*18,Round))","v":0}]

{"sheet":"VRU Upper Legform","index":14,"n_rows":35,"n_cols":28,"rows_kept":35,"cut":false,"hidden":false,"merged":[[11,24,11,25],[13,24,13,25],[10,24,10,25],[9,24,9,25],[9,22,9,23],[27,20,27,21],[3,18,3,19],[7,18,7,19],[8,18,8,19],[9,18,9,19],[10,18,10,19],[11,18,11,19],[27,18,27,19],[24,18,24,19],[26,18,26,19],[25,18,25,19],[14,18,14,19],[15,18,15,19],[16,18,16,19],[17,18,17,19],[18,18,18,19],[19,18,19,19],[23,18,23,19],[12,18,12,19],[27,22,27,23],[6,4,6,5],[7,4,7,5],[8,4,8,5],[9,4,9,5],[10,4,10,5],[11,4,11,5],[12,4,12,5],[13,4,13,5],[14,4,14,5],[16,4,16,5],[17,4,17,5],[18,4,18,5],[19,4,19,5],[20,4,20,5],[21,4,21,5],[22,4,22,5],[21,18,21,19],[22,18,22,19],[23,4,23,5],[24,4,24,5],[18,22,18,23],[19,22,19,23],[25,4,25,5],[26,4,26,5],[27,4,27,5],[1,1,2,5],[3,1,3,5],[4,1,4,5],[15,4,15,5],[6,1,6,2],[2,6,2,9],[5,1,5,5],[1,6,1,17],[2,10,2,13],[4,10,4,13],[2,14,2,17],[5,14,5,17],[5,10,5,13],[17,6,17,9],[18,6,18,9],[19,6,19,9],[20,6,20,9],[22,6,22,9],[23,6,23,9],[24,6,24,9],[25,6,25,9],[26,6,26,9],[26,20,26,21],[22,22,22,23],[23,22,23,23],[20,22,20,23],[10,22,10,23],[20,20,20,21],[21,20,21,21],[22,20,22,21],[23,20,23,21],[14,22,14,23],[12,22,12,23],[11,22,11,23],[13,18,13,19],[6,6,6,9],[5,6,5,9],[6,10,6,13],[12,6,12,9],[13,6,13,9],[14,6,14,9],[15,6,15,9],[16,6,16,9],[15,14,15,17],[16,14,16,17],[10,6,10,9],[11,6,11,9],[8,14,8,17],[9,14,9,17],[10,14,10,17],[11,14,11,17],[12,14,12,17],[13,14,13,17],[14,14,14,17],[20,18,20,19],[6,20,6,21],[3,6,3,9],[3,10,3,13],[3,14,3,17],[24,22,24,23],[3,22,3,23],[4,6,4,9],[8,20,8,21],[9,20,9,21],[10,20,10,21],[11,20,11,21],[12,20,12,21],[13,20,13,21],[24,20,24,21],[14,20,14,21],[15,20,15,21],[16,20,16,21],[17,20,17,21],[18,20,18,21],[19,20,19,21],[7,6,7,9],[8,6,8,9],[9,6,9,9],[8,22,8,23],[4,14,4,17],[5,20,5,21],[4,20,4,21],[5,22,5,25],[7,22,7,23],[4,22,4,25],[6,22,6,25],[7,20,7,21],[6,14,6,17],[7,14,7,17],[6,18,6,19],[4,18,4,19],[5,18,5,19],[1,18,1,25],[11,26,11,27],[12,26,12,27],[13,26,13,27],[14,26,14,27],[2,18,2,19],[2,20,2,21],[2,22,2,25],[3,24,3,25],[3,20,3,21],[1,26,2,27],[3,26,3,27],[4,26,4,27],[5,26,5,27],[6,26,6,27],[7,26,7,27],[8,26,8,27],[9,26,9,27],[10,26,10,27],[13,22,13,23],[12,24,12,25],[14,24,14,25],[7,24,7,25],[8,24,8,25],[19,26,19,27],[20,26,20,27],[21,26,21,27],[22,26,22,27],[15,22,15,23],[18,24,18,25],[19,24,19,25],[20,24,20,25],[16,24,16,25],[15,26,15,27],[16,26,16,27],[17,26,17,27],[18,26,18,27],[17,22,17,23],[15,24,15,25],[21,22,21,23],[17,24,17,25],[16,22,16,23],[32,6,32,27],[34,1,34,5],[34,6,34,27],[32,1,32,5],[25,24,25,25],[21,24,21,25],[22,24,22,25],[26,24,26,25],[28,1,28,27],[27,24,27,25],[24,24,24,25],[23,24,23,25],[31,1,31,27],[29,1,29,5],[30,1,30,5],[24,26,24,27],[25,26,25,27],[26,26,26,27],[27,26,27,27],[23,26,23,27],[25,22,25,23],[26,22,26,23],[25,20,25,21],[21,6,21,9],[27,6,27,9],[7,10,7,13],[8,10,8,13],[9,10,9,13],[10,10,10,13],[11,10,11,13],[12,10,12,13],[13,10,13,13],[14,10,14,13],[15,10,15,13],[16,10,16,13],[17,10,17,13],[18,10,18,13],[19,10,19,13],[20,10,20,13],[21,10,21,13],[22,10,22,13],[23,10,23,13],[24,10,24,13],[25,10,25,13],[26,10,26,13],[17,14,17,17],[18,14,18,17],[19,14,19,17],[27,10,27,13],[20,14,20,17],[21,14,21,17],[22,14,22,17],[23,14,23,17],[24,14,24,17],[25,14,25,17],[26,14,26,17],[27,14,27,17]]}
[]
[null,"Pedestrian Upper Legform",null,null,null,null,"Bending Moment",null,null,null,null,null,null,null,null,null,null,null,"Forces",null,null,null,null,null,null,null,"Total"]
[null,null,null,null,null,null,"upper",null,null,null,"centre",null,null,null,"lower",null,null,null,"upper",null,"lower",null,"sum"]
[null,{"$f":"'General Overview'!G10","v":""},null,null,null,null,"Value",null,null,null,"Value",null,null,null,"Value",null,null,null,"Value",null,"Value",null,"Value",null,"Points",null,"Points"]
[null,"UPPER LEGFORM"]
[]
[null,"Points to test",null,null,"Test Energy - J"]
[null,null,"U +10",null,null,null,null,null,null,null,null,null,null,null,null,null,null,null,null,null,null,null,null,null,{"$f":"IF(NOT($D8=\"Tested\"),\"\",ROUND(Sliding_Scale(W8,5,6,1,0),Round))","v":""},null,{"$f":"IF($D8=\"N/A\",\"\",IF($D8=\"Default\",1,IF($D8=\"Tested\",MIN(Y8),IF($D8=\"Symmetry\",INDIRECT(ADDRESS((18-ROW(C8))*2+ROW(C8),27)),IF(OR($D8=\"Adjacent\"),MIN(AA7,AA9),\"\")))))","v":""}]
[null,null,"U +9",null,null,null,null,null,null,null,null,null,null,null,null,null,null,null,null,null,null,null,null,null,"",null,{"$f":"IF($D9=\"N/A\",\"\",IF($D9=\"Default\",1,IF($D9=\"Tested\",MIN(Y9),IF($D9=\"Symmetry\",INDIRECT(ADDRESS((18-ROW(C9))*2+ROW(C9),27)),IF(OR($D9=\"Adjacent\"),MIN(AA8,AA10),\"\")))))","v":""}]
[null,null,"U +8",null,null,null,null,null,null,null,null,null,null,null,null,null,null,null,null,null,null,null,null,null,"",null,""]
[null,null,"U +7",null,null,null,null,null,null,null,null,null,null,null,null,null,null,null,null,null,null,null,null,null,"",null,""]
[null,null,"U +6",null,null,null,null,null,null,null,null,null,null,null,null,null,null,null,null,null,null,null,null,null,"",null,""]
[null,null,"U +5",null,null,null,null,null,null,null,null,null,null,null,null,null,null,null,null,null,null,null,null,null,"",null,""]
[null,null,"U +4",null,null,null,null,null,null,null,null,null,null,null,null,null,null,null,null,null,null,null,null,null,"",null,""]
[null,null,"U +3",null,null,null,null,null,null,null,null,null,null,null,null,null,null,null,null,null,null,null,null,null,"",null,""]
[null,null,"U +2",null,null,null,null,null,null,null,null,null,null,null,null,null,null,null,null,null,null,null,null,null,"",null,""]
[null,null,"U +1",null,null,null,null,null,null,null,null,null,null,null,null,null,null,null,null,null,null,null,null,null,"",null,""]
[null,null,"U 0",null,null,null,null,null,null,null,null,null,null,null,null,null,null,null,null,null,null,null,null,null,"",null,""]
[null,null,"U -1",null,null,null,null,null,null,null,null,null,null,null,null,null,null,null,null,null,null,null,null,null,"",null,""]
[null,null,"U -2",null,null,null,null,null,null,null,null,null,null,null,null,null,null,null,null,null,null,null,null,null,"",null,""]
[null,null,"U -3",null,null,null,null,null,null,null,null,null,null,null,null,null,null,null,null,null,null,null,null,null,"",null,""]
[null,null,"U -4",null,null,null,null,null,null,null,null,null,null,null,null,null,null,null,null,null,null,null,null,null,"",null,""]
[null,null,"U -5",null,null,null,null,null,null,null,null,null,null,null,null,null,null,null,null,null,null,null,null,null,"",null,""]
[null,null,"U -6",null,null,null,null,null,null,null,null,null,null,null,null,null,null,null,null,null,null,null,null,null,"",null,""]
[null,null,"U -7",null,null,null,null,null,null,null,null,null,null,null,null,null,null,null,null,null,null,null,null,null,"",null,""]
[null,null,"U -8",null,null,null,null,null,null,null,null,null,null,null,null,null,null,null,null,null,null,null,null,null,"",null,""]
[null,null,"U -9",null,null,null,null,null,null,null,null,null,null,null,null,null,null,null,null,null,null,null,null,null,"",null,""]
[null,null,"U -10",null,null,null,null,null,null,null,null,null,null,null,null,null,null,null,null,null,null,null,null,null,"",null,""]
[]
[null,null,null,null,null,null,null,"+10","+9","+8","+7","+6","+5","+4","+3","+2","+1","0","-1","-2","-3","-4","-5","-6","-7","-8","-9","-10"]
[null,null,null,null,null,null,null,{"$f":"AA8","v":""},{"$f":"AA9","v":""},{"$f":"AA10","v":""},{"$f":"AA11","v":""},{"$f":"AA12","v":""},{"$f":"AA13","v":""},{"$f":"AA14","v":""},{"$f":"AA15","v":""},{"$f":"AA16","v":""},{"$f":"AA17","v":""},{"$f":"AA18","v":""},{"$f":"AA19","v":""},{"$f":"AA20","v":""},{"$f":"AA21","v":""},{"$f":"AA22","v":""},{"$f":"AA23","v":""},{"$f":"AA24","v":""},{"$f":"AA25","v":""},{"$f":"AA26","v":""},{"$f":"AA27","v":""},{"$f":"AA28","v":""}]
[]
[null,"Upper Legform force assessment",null,null,null,null,{"$f":"IF(AA18=\"\",0,ROUND(SUM(AA8:AA28)/(21-COUNTIF(AA8:AA28,\"\"))*4.5,Round))","v":0}]
[]
[null,"TOTAL PELVIS ASSESSMENT",null,null,null,null,{"$f":"G33","v":0}]

{"sheet":"VRU Legform","index":15,"n_rows":36,"n_cols":33,"rows_kept":36,"cut":false,"hidden":false,"merged":[[21,28,21,29],[27,26,27,27],[27,28,27,29],[22,22,22,23],[22,24,22,25],[22,26,22,27],[22,28,22,29],[23,22,23,23],[23,24,23,25],[23,26,23,27],[23,28,23,29],[24,22,24,23],[24,28,24,29],[25,28,25,29],[26,24,26,25],[26,28,26,29],[26,26,26,27],[27,22,27,23],[27,24,27,25],[21,22,21,23],[21,24,21,25],[21,26,21,27],[24,24,24,25],[24,26,24,27],[25,26,25,27],[26,22,26,23],[13,24,13,25],[2,22,2,23],[2,24,2,25],[2,26,2,27],[6,22,6,23],[6,24,6,25],[9,22,9,23],[9,24,9,25],[9,26,9,27],[12,22,12,23],[12,24,12,25],[12,26,12,27],[13,26,13,27],[5,24,5,25],[1,30,3,30],[7,14,7,15],[8,14,8,15],[9,14,9,15],[6,26,6,27],[6,28,6,29],[7,22,7,23],[7,24,7,25],[7,26,7,27],[7,28,7,29],[8,22,8,23],[8,24,8,25],[8,26,8,27],[8,28,8,29],[7,20,7,21],[9,20,9,21],[8,20,8,21],[2,28,3,29],[3,22,3,27],[4,22,4,23],[4,24,4,25],[4,26,4,27],[4,28,4,29],[5,22,5,23],[20,28,20,29],[17,22,17,23],[17,24,17,25],[17,26,17,27],[17,28,17,29],[18,22,18,23],[18,24,18,25],[20,22,20,23],[20,24,20,25],[20,26,20,27],[7,4,7,5],[4,4,4,13],[4,14,4,17],[5,14,5,17],[2,16,2,17],[4,18,4,21],[5,18,5,21],[6,18,6,21],[5,4,5,13],[6,4,6,13],[6,14,6,17],[2,14,2,15],[1,1,2,3],[1,22,1,29],[5,26,5,27],[5,28,5,29],[6,1,6,2],[5,1,5,3],[4,1,4,3],[2,12,3,13],[3,1,3,3],[3,18,3,19],[3,20,3,21],[1,4,1,13],[2,4,2,5],[2,6,2,7],[2,8,2,9],[2,10,2,11],[1,14,1,17],[3,14,3,15],[3,16,3,17],[1,18,2,21],[3,4,3,11],[8,8,8,9],[8,6,8,7],[7,8,7,9],[7,10,7,11],[7,6,7,7],[11,18,11,19],[10,18,10,19],[11,16,11,17],[8,18,8,19],[7,16,7,17],[7,18,7,19],[11,8,11,9],[9,10,9,11],[9,8,9,9],[7,12,7,13],[8,12,8,13],[8,16,8,17],[10,14,10,15],[11,14,11,15],[8,10,8,11],[13,28,13,29],[9,12,9,13],[10,12,10,13],[12,28,12,29],[13,22,13,23],[11,12,11,13],[19,26,19,27],[19,28,19,29],[14,22,14,23],[14,24,14,25],[14,26,14,27],[14,28,14,29],[15,22,15,23],[15,24,15,25],[15,26,15,27],[15,28,15,29],[16,22,16,23],[16,24,16,25],[16,26,16,27],[16,28,16,29],[18,26,18,27],[18,28,18,29],[19,22,19,23],[19,24,19,25],[9,28,9,29],[10,22,10,23],[10,24,10,25],[10,26,10,27],[10,28,10,29],[11,22,11,23],[11,24,11,25],[11,26,11,27],[11,28,11,29],[12,20,12,21],[13,20,13,21],[9,18,9,19],[10,20,10,21],[19,18,19,19],[9,16,9,17],[10,16,10,17],[14,20,14,21],[15,20,15,21],[19,16,19,17],[12,16,12,17],[11,20,11,21],[13,18,13,19],[18,20,18,21],[19,20,19,21],[16,20,16,21],[17,20,17,21],[15,18,15,19],[12,18,12,19],[14,18,14,19],[16,18,16,19],[13,16,13,17],[14,16,14,17],[15,16,15,17],[27,20,27,21],[27,12,27,13],[24,4,24,5],[26,4,26,5],[23,4,23,5],[27,4,27,5],[24,12,24,13],[21,18,21,19],[20,14,20,15],[21,20,21,21],[22,20,22,21],[23,20,23,21],[24,20,24,21],[25,12,25,13],[26,18,26,19],[26,12,26,13],[26,20,26,21],[24,18,24,19],[20,20,20,21],[27,14,27,15],[25,4,25,5],[27,16,27,17],[27,18,27,19],[22,18,22,19],[23,18,23,19],[22,16,22,17],[24,16,24,17],[20,18,20,19],[20,12,20,13],[21,12,21,13],[20,16,20,17],[22,14,22,15],[23,14,23,15],[24,14,24,15],[23,16,23,17],[21,16,21,17],[26,16,26,17],[25,14,25,15],[26,14,26,15],[22,12,22,13],[20,4,20,5],[22,8,22,9],[20,6,20,7],[21,8,21,9],[17,16,17,17],[19,14,19,15],[18,12,18,13],[21,14,21,15],[19,12,19,13],[25,16,25,17],[14,4,14,5],[12,4,12,5],[12,6,12,7],[14,8,14,9],[16,6,16,7],[17,6,17,7],[17,8,17,9],[16,10,16,11],[16,8,16,9],[17,10,17,11],[18,18,18,19],[16,16,16,17],[17,18,17,19],[16,12,16,13],[17,12,17,13],[18,16,18,17],[16,14,16,15],[17,14,17,15],[18,14,18,15],[35,4,35,24],[33,1,35,3],[29,1,31,3],[31,4,31,24],[27,6,27,7],[27,8,27,9],[23,10,23,11],[27,10,27,11],[24,6,24,7],[25,8,25,9],[25,10,25,11],[24,8,24,9],[24,10,24,11],[23,8,23,9],[26,6,26,7],[26,8,26,9],[26,10,26,11],[25,6,25,7],[23,6,23,7],[25,20,25,21],[25,18,25,19],[23,12,23,13],[25,22,25,23],[25,24,25,25],[9,4,9,5],[9,6,9,7],[8,4,8,5],[22,4,22,5],[22,6,22,7],[19,4,19,5],[19,6,19,7],[19,8,19,9],[19,10,19,11],[18,8,18,9],[20,8,20,9],[20,10,20,11],[21,4,21,5],[17,4,17,5],[16,4,16,5],[18,4,18,5],[18,6,18,7],[11,4,11,5],[11,6,11,7],[15,8,15,9],[21,10,21,11],[22,10,22,11],[18,10,18,11],[21,6,21,7],[12,14,12,15],[13,14,13,15],[14,14,14,15],[15,14,15,15],[10,4,10,5],[10,6,10,7],[10,8,10,9],[10,10,10,11],[11,10,11,11],[13,4,13,5],[13,6,13,7],[13,8,13,9],[13,10,13,11],[12,12,12,13],[13,12,13,13],[14,12,14,13],[15,12,15,13],[12,8,12,9],[15,4,15,5],[15,6,15,7],[12,10,12,11],[14,6,14,7],[14,10,14,11],[15,10,15,11]]}
[]
[null,"Pedestrian Legform (aPLI)",null,null,"Tibia Bending Moment",null,null,null,null,null,null,null,null,null,"ACL/PCL",null,null,null,"MCL Elongation",null,null,null,"Femur Bending Moment",null,null,null,null,null,null,null,"Acceleration","Total","Total"]
[null,null,null,null,"T4",null,"T3",null,"T2",null,"T1",null,"Points",null,"ACL",null,"PCL",null,null,null,null,null,"F1",null,"F2",null,"F3",null,"Points",null,null,"Tibia & MCL","Femur"]
[null,{"$f":"'General Overview'!G10","v":""},null,null,"Value",null,null,null,null,null,null,null,null,null,"Value",null,"Value",null,"Value",null,"Points",null,"Value",null,null,null,null,null,null,null,null,"Points","Points"]
[null,"LOWER LEGFORM"]
[]
[null,"Points to test"]
[null,null,"L +10",null,null,null,null,null,null,null,null,null,{"$f":"IF(NOT($D8=\"Tested\"),\"\",ROUND(Sliding_Scale(MAX(E8,G8,I8,K8),275,320,1,0),Round))","v":""},null,null,null,null,null,null,null,{"$f":"IF(NOT($D8=\"Tested\"),\"\",ROUND(Sliding_Scale(S8,27,32,1,0),Round))","v":""},null,null,null,null,null,null,null,{"$f":"IF(NOT($D8=\"Tested\"),\"\",ROUND(Sliding_Scale(MAX(W8,Y8,AA8),390,440,1,0),Round))","v":""},null,null,{"$f":"IF($D8=\"N/A\",\"\",IF($D8=\"Tested\",MIN(M8,U8),IF($D8=\"Symmetry\",INDIRECT(ADDRESS((18-ROW(C8))*2+ROW(C8),32)),IF($D8=\"Adjacent\",MIN(AF7,AF9),\"\"))))","v":""},{"$f":"IF($D8=\"N/A\",\"\",IF($D8=\"Tested\",AC8,IF($D8=\"Symmetry\",INDIRECT(ADDRESS((18-ROW(C8))*2+ROW(C8),33)),IF($D8=\"Adjacent\",MIN(AG7,AG9),\"\"))))","v":""}]
[null,null,"L +9",null,null,null,null,null,null,null,null,null,{"$f":"IF(NOT($D9=\"Tested\"),\"\",ROUND(Sliding_Scale(MAX(E9,G9,I9,K9),275,320,1,0),Round))","v":""},null,null,null,null,null,null,null,{"$f":"IF(NOT($D9=\"Tested\"),\"\",ROUND(Sliding_Scale(S9,27,32,1,0),Round))","v":""},null,null,null,null,null,null,null,{"$f":"IF(NOT($D9=\"Tested\"),\"\",ROUND(Sliding_Scale(MAX(W9,Y9,AA9),390,440,1,0),Round))","v":""},null,null,{"$f":"IF($D9=\"N/A\",\"\",IF($D9=\"Tested\",MIN(M9,U9),IF($D9=\"Symmetry\",INDIRECT(ADDRESS((18-ROW(C9))*2+ROW(C9),32)),IF($D9=\"Adjacent\",MIN(AF8,AF10),\"\"))))","v":""},{"$f":"IF($D9=\"N/A\",\"\",IF($D9=\"Tested\",AC9,IF($D9=\"Symmetry\",INDIRECT(ADDRESS((18-ROW(C9))*2+ROW(C9),33)),IF($D9=\"Adjacent\",MIN(AG8,AG10),\"\"))))","v":""}]
[null,null,"L +8",null,null,null,null,null,null,null,null,null,{"$f":"IF(NOT($D10=\"Tested\"),\"\",ROUND(Sliding_Scale(MAX(E10,G10,I10,K10),275,320,1,0),Round))","v":""},null,null,null,null,null,null,null,{"$f":"IF(NOT($D10=\"Tested\"),\"\",ROUND(Sliding_Scale(S10,27,32,1,0),Round))","v":""},null,null,null,null,null,null,null,{"$f":"IF(NOT($D10=\"Tested\"),\"\",ROUND(Sliding_Scale(MAX(W10,Y10,AA10),390,440,1,0),Round))","v":""},null,null,"",""]
[null,null,"L +7",null,null,null,null,null,null,null,null,null,{"$f":"IF(NOT($D11=\"Tested\"),\"\",ROUND(Sliding_Scale(MAX(E11,G11,I11,K11),275,320,1,0),Round))","v":""},null,null,null,null,null,null,null,{"$f":"IF(NOT($D11=\"Tested\"),\"\",ROUND(Sliding_Scale(S11,27,32,1,0),Round))","v":""},null,null,null,null,null,null,null,{"$f":"IF(NOT($D11=\"Tested\"),\"\",ROUND(Sliding_Scale(MAX(W11,Y11,AA11),390,440,1,0),Round))","v":""},null,null,"",""]
[null,null,"L +6",null,null,null,null,null,null,null,null,null,{"$f":"IF(NOT($D12=\"Tested\"),\"\",ROUND(Sliding_Scale(MAX(E12,G12,I12,K12),275,320,1,0),Round))","v":""},null,null,null,null,null,null,null,{"$f":"IF(NOT($D12=\"Tested\"),\"\",ROUND(Sliding_Scale(S12,27,32,1,0),Round))","v":""},null,null,null,null,null,null,null,{"$f":"IF(NOT($D12=\"Tested\"),\"\",ROUND(Sliding_Scale(MAX(W12,Y12,AA12),390,440,1,0),Round))","v":""},null,null,"",""]
[null,null,"L +5",null,null,null,null,null,null,null,null,null,{"$f":"IF(NOT($D13=\"Tested\"),\"\",ROUND(Sliding_Scale(MAX(E13,G13,I13,K13),275,320,1,0),Round))","v":""},null,null,null,null,null,null,null,{"$f":"IF(NOT($D13=\"Tested\"),\"\",ROUND(Sliding_Scale(S13,27,32,1,0),Round))","v":""},null,null,null,null,null,null,null,{"$f":"IF(NOT($D13=\"Tested\"),\"\",ROUND(Sliding_Scale(MAX(W13,Y13,AA13),390,440,1,0),Round))","v":""},null,null,"",""]
[null,null,"L +4",null,null,null,null,null,null,null,null,null,{"$f":"IF(NOT($D14=\"Tested\"),\"\",ROUND(Sliding_Scale(MAX(E14,G14,I14,K14),275,320,1,0),Round))","v":""},null,null,null,null,null,null,null,{"$f":"IF(NOT($D14=\"Tested\"),\"\",ROUND(Sliding_Scale(S14,27,32,1,0),Round))","v":""},null,null,null,null,null,null,null,{"$f":"IF(NOT($D14=\"Tested\"),\"\",ROUND(Sliding_Scale(MAX(W14,Y14,AA14),390,440,1,0),Round))","v":""},null,null,"",""]
[null,null,"L +3",null,null,null,null,null,null,null,null,null,{"$f":"IF(NOT($D15=\"Tested\"),\"\",ROUND(Sliding_Scale(MAX(E15,G15,I15,K15),275,320,1,0),Round))","v":""},null,null,null,null,null,null,null,{"$f":"IF(NOT($D15=\"Tested\"),\"\",ROUND(Sliding_Scale(S15,27,32,1,0),Round))","v":""},null,null,null,null,null,null,null,{"$f":"IF(NOT($D15=\"Tested\"),\"\",ROUND(Sliding_Scale(MAX(W15,Y15,AA15),390,440,1,0),Round))","v":""},null,null,"",""]
[null,null,"L +2",null,null,null,null,null,null,null,null,null,{"$f":"IF(NOT($D16=\"Tested\"),\"\",ROUND(Sliding_Scale(MAX(E16,G16,I16,K16),275,320,1,0),Round))","v":""},null,null,null,null,null,null,null,{"$f":"IF(NOT($D16=\"Tested\"),\"\",ROUND(Sliding_Scale(S16,27,32,1,0),Round))","v":""},null,null,null,null,null,null,null,{"$f":"IF(NOT($D16=\"Tested\"),\"\",ROUND(Sliding_Scale(MAX(W16,Y16,AA16),390,440,1,0),Round))","v":""},null,null,"",""]
[null,null,"L +1",null,null,null,null,null,null,null,null,null,{"$f":"IF(NOT($D17=\"Tested\"),\"\",ROUND(Sliding_Scale(MAX(E17,G17,I17,K17),275,320,1,0),Round))","v":""},null,null,null,null,null,null,null,{"$f":"IF(NOT($D17=\"Tested\"),\"\",ROUND(Sliding_Scale(S17,27,32,1,0),Round))","v":""},null,null,null,null,null,null,null,{"$f":"IF(NOT($D17=\"Tested\"),\"\",ROUND(Sliding_Scale(MAX(W17,Y17,AA17),390,440,1,0),Round))","v":""},null,null,"",""]
[null,null,"L 0",null,null,null,null,null,null,null,null,null,{"$f":"IF(NOT($D18=\"Tested\"),\"\",ROUND(Sliding_Scale(MAX(E18,G18,I18,K18),275,320,1,0),Round))","v":""},null,null,null,null,null,null,null,{"$f":"IF(NOT($D18=\"Tested\"),\"\",ROUND(Sliding_Scale(S18,27,32,1,0),Round))","v":""},null,null,null,null,null,null,null,{"$f":"IF(NOT($D18=\"Tested\"),\"\",ROUND(Sliding_Scale(MAX(W18,Y18,AA18),390,440,1,0),Round))","v":""},null,null,"",""]
[null,null,"L -1",null,null,null,null,null,null,null,null,null,{"$f":"IF(NOT($D19=\"Tested\"),\"\",ROUND(Sliding_Scale(MAX(E19,G19,I19,K19),275,320,1,0),Round))","v":""},null,null,null,null,null,null,null,{"$f":"IF(NOT($D19=\"Tested\"),\"\",ROUND(Sliding_Scale(S19,27,32,1,0),Round))","v":""},null,null,null,null,null,null,null,{"$f":"IF(NOT($D19=\"Tested\"),\"\",ROUND(Sliding_Scale(MAX(W19,Y19,AA19),390,440,1,0),Round))","v":""},null,null,"",""]
[null,null,"L -2",null,null,null,null,null,null,null,null,null,{"$f":"IF(NOT($D20=\"Tested\"),\"\",ROUND(Sliding_Scale(MAX(E20,G20,I20,K20),275,320,1,0),Round))","v":""},null,null,null,null,null,null,null,{"$f":"IF(NOT($D20=\"Tested\"),\"\",ROUND(Sliding_Scale(S20,27,32,1,0),Round))","v":""},null,null,null,null,null,null,null,{"$f":"IF(NOT($D20=\"Tested\"),\"\",ROUND(Sliding_Scale(MAX(W20,Y20,AA20),390,440,1,0),Round))","v":""},null,null,"",""]
[null,null,"L -3",null,null,null,null,null,null,null,null,null,{"$f":"IF(NOT($D21=\"Tested\"),\"\",ROUND(Sliding_Scale(MAX(E21,G21,I21,K21),275,320,1,0),Round))","v":""},null,null,null,null,null,null,null,{"$f":"IF(NOT($D21=\"Tested\"),\"\",ROUND(Sliding_Scale(S21,27,32,1,0),Round))","v":""},null,null,null,null,null,null,null,{"$f":"IF(NOT($D21=\"Tested\"),\"\",ROUND(Sliding_Scale(MAX(W21,Y21,AA21),390,440,1,0),Round))","v":""},null,null,"",""]
[null,null,"L -4",null,null,null,null,null,null,null,null,null,{"$f":"IF(NOT($D22=\"Tested\"),\"\",ROUND(Sliding_Scale(MAX(E22,G22,I22,K22),275,320,1,0),Round))","v":""},null,null,null,null,null,null,null,{"$f":"IF(NOT($D22=\"Tested\"),\"\",ROUND(Sliding_Scale(S22,27,32,1,0),Round))","v":""},null,null,null,null,null,null,null,{"$f":"IF(NOT($D22=\"Tested\"),\"\",ROUND(Sliding_Scale(MAX(W22,Y22,AA22),390,440,1,0),Round))","v":""},null,null,"",""]
[null,null,"L -5",null,null,null,null,null,null,null,null,null,{"$f":"IF(NOT($D23=\"Tested\"),\"\",ROUND(Sliding_Scale(MAX(E23,G23,I23,K23),275,320,1,0),Round))","v":""},null,null,null,null,null,null,null,{"$f":"IF(NOT($D23=\"Tested\"),\"\",ROUND(Sliding_Scale(S23,27,32,1,0),Round))","v":""},null,null,null,null,null,null,null,{"$f":"IF(NOT($D23=\"Tested\"),\"\",ROUND(Sliding_Scale(MAX(W23,Y23,AA23),390,440,1,0),Round))","v":""},null,null,"",""]
[null,null,"L -6",null,null,null,null,null,null,null,null,null,{"$f":"IF(NOT($D24=\"Tested\"),\"\",ROUND(Sliding_Scale(MAX(E24,G24,I24,K24),275,320,1,0),Round))","v":""},null,null,null,null,null,null,null,{"$f":"IF(NOT($D24=\"Tested\"),\"\",ROUND(Sliding_Scale(S24,27,32,1,0),Round))","v":""},null,null,null,null,null,null,null,{"$f":"IF(NOT($D24=\"Tested\"),\"\",ROUND(Sliding_Scale(MAX(W24,Y24,AA24),390,440,1,0),Round))","v":""},null,null,"",""]
[null,null,"L -7",null,null,null,null,null,null,null,null,null,{"$f":"IF(NOT($D25=\"Tested\"),\"\",ROUND(Sliding_Scale(MAX(E25,G25,I25,K25),275,320,1,0),Round))","v":""},null,null,null,null,null,null,null,{"$f":"IF(NOT($D25=\"Tested\"),\"\",ROUND(Sliding_Scale(S25,27,32,1,0),Round))","v":""},null,null,null,null,null,null,null,{"$f":"IF(NOT($D25=\"Tested\"),\"\",ROUND(Sliding_Scale(MAX(W25,Y25,AA25),390,440,1,0),Round))","v":""},null,null,"",""]
[null,null,"L -8",null,null,null,null,null,null,null,null,null,{"$f":"IF(NOT($D26=\"Tested\"),\"\",ROUND(Sliding_Scale(MAX(E26,G26,I26,K26),275,320,1,0),Round))","v":""},null,null,null,null,null,null,null,{"$f":"IF(NOT($D26=\"Tested\"),\"\",ROUND(Sliding_Scale(S26,27,32,1,0),Round))","v":""},null,null,null,null,null,null,null,{"$f":"IF(NOT($D26=\"Tested\"),\"\",ROUND(Sliding_Scale(MAX(W26,Y26,AA26),390,440,1,0),Round))","v":""},null,null,"",""]
[null,null,"L -9",null,null,null,null,null,null,null,null,null,{"$f":"IF(NOT($D27=\"Tested\"),\"\",ROUND(Sliding_Scale(MAX(E27,G27,I27,K27),275,320,1,0),Round))","v":""},null,null,null,null,null,null,null,{"$f":"IF(NOT($D27=\"Tested\"),\"\",ROUND(Sliding_Scale(S27,27,32,1,0),Round))","v":""},null,null,null,null,null,null,null,{"$f":"IF(NOT($D27=\"Tested\"),\"\",ROUND(Sliding_Scale(MAX(W27,Y27,AA27),390,440,1,0),Round))","v":""},null,null,"",""]
[null,null,"L -10",null,null,null,null,null,null,null,null,null,{"$f":"IF(NOT($D28=\"Tested\"),\"\",ROUND(Sliding_Scale(MAX(E28,G28,I28,K28),275,320,1,0),Round))","v":""},null,null,null,null,null,null,null,{"$f":"IF(NOT($D28=\"Tested\"),\"\",ROUND(Sliding_Scale(S28,27,32,1,0),Round))","v":""},null,null,null,null,null,null,null,{"$f":"IF(NOT($D28=\"Tested\"),\"\",ROUND(Sliding_Scale(MAX(W28,Y28,AA28),390,440,1,0),Round))","v":""},null,null,"",""]
[]
[null,"TOTAL FEMUR ASSESSMENT",null,null,"+10","+9","+8","+7","+6","+5","+4","+3","+2","+1","0","-1","-2","-3","-4","-5","-6","-7","-8","-9","-10"]
[null,null,null,null,{"$f":"AG8","v":""},{"$f":"AG9","v":""},{"$f":"AG10","v":""},{"$f":"AG11","v":""},{"$f":"AG12","v":""},{"$f":"AG13","v":""},{"$f":"AG14","v":""},{"$f":"AG15","v":""},{"$f":"AG16","v":""},{"$f":"AG17","v":""},{"$f":"AG18","v":""},{"$f":"AG19","v":""},{"$f":"AG20","v":""},{"$f":"AG21","v":""},{"$f":"AG22","v":""},{"$f":"AG23","v":""},{"$f":"AG24","v":""},{"$f":"AG25","v":""},{"$f":"AG26","v":""},{"$f":"AG27","v":""},{"$f":"AG28","v":""}]
[null,null,null,null,{"$f":"IF(AG18=\"\",0,ROUND(SUM(AG8:AG28)/(21-COUNTIF(AG8:AG28,\"\"))*4.5,Round))","v":0}]
[]
[null,"TOTAL KNEE & TIBIA ASSESSMENT",null,null,"+10","+9","+8","+7","+6","+5","+4","+3","+2","+1","0","-1","-2","-3","-4","-5","-6","-7","-8","-9","-10"]
[null,null,null,null,{"$f":"AF8","v":""},{"$f":"AF9","v":""},{"$f":"AF10","v":""},{"$f":"AF11","v":""},{"$f":"AF12","v":""},{"$f":"AF13","v":""},{"$f":"AF14","v":""},{"$f":"AF15","v":""},{"$f":"AF16","v":""},{"$f":"AF17","v":""},{"$f":"AF18","v":""},{"$f":"AF19","v":""},{"$f":"AF20","v":""},{"$f":"AF21","v":""},{"$f":"AF22","v":""},{"$f":"AF23","v":""},{"$f":"AF24","v":""},{"$f":"AF25","v":""},{"$f":"AF26","v":""},{"$f":"AF27","v":""},{"$f":"AF28","v":""}]
[null,null,null,null,{"$f":"IF(AF18=\"\",0,ROUND(SUM(AF8:AF28)/(21-COUNTIF(AF8:AF28,\"\"))*9,Round))","v":0}]

{"sheet":"VRU AEB Pedestrian","index":16,"n_rows":94,"n_cols":25,"rows_kept":94,"cut":false,"hidden":false,"merged":[[46,1,46,2],[46,3,46,5],[46,6,46,8],[17,3,17,14],[31,6,31,8],[31,9,31,11],[31,12,31,14],[31,3,31,5],[1,1,2,2],[3,1,3,2],[33,3,33,5],[33,6,33,8],[8,3,8,14],[1,3,3,14],[4,3,4,14],[5,3,5,14],[6,3,6,14],[7,3,7,14],[15,1,15,2],[12,3,12,8],[12,9,12,14],[31,1,31,2],[13,3,13,14],[14,3,14,14],[91,1,91,2],[91,3,91,8],[91,9,91,14],[72,3,72,8],[72,9,72,14],[48,3,48,8],[84,6,84,8],[75,3,75,5],[87,3,87,5],[87,6,87,8],[49,3,49,5],[49,6,49,8],[75,6,75,8],[51,6,51,8],[63,6,63,7],[78,6,78,7],[82,1,82,2],[64,1,64,2],[64,3,64,5],[64,6,64,8],[85,6,85,8],[80,1,80,2],[60,3,60,5],[61,3,61,5],[93,1,93,2],[18,3,18,5],[18,6,18,8],[18,9,18,11],[18,12,18,14],[86,3,86,5],[88,3,88,5],[89,3,89,5],[90,3,90,5],[77,6,77,7],[67,3,67,5],[67,9,67,11],[54,12,54,14],[55,12,55,14],[56,12,56,14],[74,3,74,14],[62,12,62,13],[63,12,63,13],[60,12,60,13],[61,12,61,13],[60,6,60,7],[64,9,64,11],[67,6,67,8],[67,12,67,14],[72,1,72,2],[80,12,80,14],[80,3,80,11],[77,3,77,4],[78,3,78,4],[70,6,70,8],[70,12,70,14],[71,6,71,8],[66,3,66,14],[76,3,76,4],[76,6,76,7],[71,12,71,14],[69,12,69,13],[75,12,75,14],[75,9,75,11],[68,6,68,7],[68,9,68,10],[79,3,79,14],[93,3,93,14],[32,3,32,14],[33,9,33,11],[33,12,33,14],[61,6,61,7],[62,6,62,7],[82,3,82,8],[63,3,63,5],[82,9,82,14],[68,12,68,13],[52,6,52,8],[53,6,53,8],[54,6,54,8],[55,6,55,8],[56,6,56,8],[53,12,53,14],[50,12,50,13],[57,12,57,13],[58,12,58,13],[59,12,59,13],[52,12,52,14],[51,12,51,14],[87,12,87,14],[88,12,88,14],[10,9,11,14],[10,3,11,8],[15,3,15,14],[83,3,83,5],[83,6,83,8],[83,9,83,11],[83,12,83,14],[50,6,50,7],[57,6,57,7],[58,6,58,7],[59,6,59,7],[76,9,76,10],[76,12,76,13],[68,3,68,4],[69,3,69,4],[70,3,70,4],[71,3,71,4],[69,6,69,7],[69,9,69,10],[70,9,70,10],[71,9,71,10],[84,3,84,5],[85,3,85,5],[84,9,84,11],[85,9,85,11],[84,12,84,14],[85,12,85,14],[88,6,88,8],[46,9,46,11],[46,12,46,14],[62,3,62,5],[60,9,60,11],[61,9,61,11],[62,9,62,11],[64,12,64,14],[63,9,63,11],[48,9,48,14],[49,9,49,11],[49,12,49,14],[89,6,89,8],[90,6,90,8],[77,9,77,10],[78,9,78,10],[77,12,77,13],[78,12,78,13],[90,9,90,14],[89,9,89,14],[86,12,86,14],[86,9,86,11],[87,9,87,11],[88,9,88,11],[86,6,86,8]]}
[3]
[null,"AEB Pedestrian"]
[]
[null,{"$f":"'General Overview'!G11","v":""}]
[null,"SYSTEM DETAILS"]
[null,null,"System Name"]
[null,null,"Functionality"]
[null,null,"Speed range (km/h) - Minimum"]
[null,null,"Maximum"]
[]
[null,"PREREQUISITES",null,"DAYTIME",null,null,null,null,null,"NIGHT-TIME"]
[]
[null,null,"Can identify slower walking pedestrian (CPNA-75) from 10 km/h"]
[null,null,"Default ON"]
[null,null,"System switches off below 80 km/h"]
[null,"PREREQUISITES",null,{"$f":"IF(AND(D14=\"YES\",D13=\"YES\", J13=\"YES\",D15=\"NO\",SUM('OVERALL RATING'!H7:H10)>18),\"PASS\",\"FAIL\")","v":"FAIL"}]
[]
[null,"CROSSING",null,"DAYTIME"]
[null,null,null,"CPFA-50",null,null,"CPNA-25",null,null,"CPNA-75",null,null,"CPNCO-50"]
[null,0,"<--Target speed for relative impact speed judgement","OEM","Vimpact","Points","OEM","Vimpact","Points","OEM","Vimpact","Points","OEM","Vimpact","Points"]
[null,1,10,null,null,{"$f":"$B21*(IF(D21=\"\",0,IF(E21=\"\",VLOOKUP(D21,$X$53:$Y$57,2,TRUE),IF(AND((E21-$B$20)<($S50:$W50 INDIRECT(\"CPFA50\"&D21)+2),(E21-$B$20)>=($S50:$W50 INDIRECT(\"CPFA50\"&D21)-12)),VLOOKUP(D21,$X$53:$Y$57,2),MAX(IF((E21-$B$20)<$S50:$W50,$S$65:$W$65,0))))))","v":0},null,null,{"$f":"$B21*(IF(G21=\"\",0,IF(H21=\"\",VLOOKUP(G21,$X$53:$Y$57,2,TRUE),IF(AND((H21-$B$20)<($S50:$W50 INDIRECT(\"CPFA50\"&G21)+2),(H21-$B$20)>=($S50:$W50 INDIRECT(\"CPFA50\"&G21)-12)),VLOOKUP(G21,$X$53:$Y$57,2),MAX(IF((H21-$B$20)<$S50:$W50,$S$65:$W$65,0))))))","v":0},null,null,{"$f":"$B21*(IF(J21=\"\",0,IF(K21=\"\",VLOOKUP(J21,$X$53:$Y$57,2,TRUE),IF(AND((K21-$B$20)<($S50:$W50 INDIRECT(\"CPFA50\"&J21)+2),(K21-$B$20)>=($S50:$W50 INDIRECT(\"CPFA50\"&J21)-12)),VLOOKUP(J21,$X$53:$Y$57,2),MAX(IF((K21-$B$20)<$S50:$W50,$S$65:$W$65,0))))))","v":0},null,null,{"$f":"$B21*(IF(M21=\"\",0,IF(N21=\"\",VLOOKUP(M21,$X$53:$Y$57,2,TRUE),IF(AND((N21-$B$20)<($S50:$W50 INDIRECT(\"CPFA50\"&M21)+2),(N21-$B$20)>=($S50:$W50 INDIRECT(\"CPFA50\"&M21)-12)),VLOOKUP(M21,$X$53:$Y$57,2),MAX(IF((N21-$B$20)<$S50:$W50,$S$65:$W$65,0))))))","v":0}]
[null,1,15,null,null,{"$f":"$B22*(IF(D22=\"\",0,IF(E22=\"\",VLOOKUP(D22,$X$53:$Y$57,2,TRUE),IF(AND((E22-$B$20)<($S51:$W51 INDIRECT(\"CPFA50\"&D22)+2),(E22-$B$20)>=($S51:$W51 INDIRECT(\"CPFA50\"&D22)-12)),VLOOKUP(D22,$X$53:$Y$57,2),MAX(IF((E22-$B$20)<$S51:$W51,$S$65:$W$65,0))))))","v":0},null,null,{"$f":"$B22*(IF(G22=\"\",0,IF(H22=\"\",VLOOKUP(G22,$X$53:$Y$57,2,TRUE),IF(AND((H22-$B$20)<($S51:$W51 INDIRECT(\"CPFA50\"&G22)+2),(H22-$B$20)>=($S51:$W51 INDIRECT(\"CPFA50\"&G22)-12)),VLOOKUP(G22,$X$53:$Y$57,2),MAX(IF((H22-$B$20)<$S51:$W51,$S$65:$W$65,0))))))","v":0},null,null,{"$f":"$B22*(IF(J22=\"\",0,IF(K22=\"\",VLOOKUP(J22,$X$53:$Y$57,2,TRUE),IF(AND((K22-$B$20)<($S51:$W51 INDIRECT(\"CPFA50\"&J22)+2),(K22-$B$20)>=($S51:$W51 INDIRECT(\"CPFA50\"&J22)-12)),VLOOKUP(J22,$X$53:$Y$57,2),MAX(IF((K22-$B$20)<$S51:$W51,$S$65:$W$65,0))))))","v":0},null,null,{"$f":"$B22*(IF(M22=\"\",0,IF(N22=\"\",VLOOKUP(M22,$X$53:$Y$57,2,TRUE),IF(AND((N22-$B$20)<($S51:$W51 INDIRECT(\"CPFA50\"&M22)+2),(N22-$B$20)>=($S51:$W51 INDIRECT(\"CPFA50\"&M22)-12)),VLOOKUP(M22,$X$53:$Y$57,2),MAX(IF((N22-$B$20)<$S51:$W51,$S$65:$W$65,0))))))","v":0}]
[null,1,20,null,null,{"$f":"$B23*(IF(D23=\"\",0,IF(E23=\"\",VLOOKUP(D23,$X$53:$Y$57,2,TRUE),IF(AND((E23-$B$20)<($S52:$W52 INDIRECT(\"CPFA50\"&D23)+2),(E23-$B$20)>=($S52:$W52 INDIRECT(\"CPFA50\"&D23)-12)),VLOOKUP(D23,$X$53:$Y$57,2),MAX(IF((E23-$B$20)<$S52:$W52,$S$65:$W$65,0))))))","v":0},null,null,{"$f":"$B23*(IF(G23=\"\",0,IF(H23=\"\",VLOOKUP(G23,$X$53:$Y$57,2,TRUE),IF(AND((H23-$B$20)<($S52:$W52 INDIRECT(\"CPFA50\"&G23)+2),(H23-$B$20)>=($S52:$W52 INDIRECT(\"CPFA50\"&G23)-12)),VLOOKUP(G23,$X$53:$Y$57,2),MAX(IF((H23-$B$20)<$S52:$W52,$S$65:$W$65,0))))))","v":0},null,null,{"$f":"$B23*(IF(J23=\"\",0,IF(K23=\"\",VLOOKUP(J23,$X$53:$Y$57,2,TRUE),IF(AND((K23-$B$20)<($S52:$W52 INDIRECT(\"CPFA50\"&J23)+2),(K23-$B$20)>=($S52:$W52 INDIRECT(\"CPFA50\"&J23)-12)),VLOOKUP(J23,$X$53:$Y$57,2),MAX(IF((K23-$B$20)<$S52:$W52,$S$65:$W$65,0))))))","v":0},null,null,{"$f":"$B23*(IF(M23=\"\",0,IF(N23=\"\",VLOOKUP(M23,$X$53:$Y$57,2,TRUE),IF(AND((N23-$B$20)<($S52:$W52 INDIRECT(\"CPFA50\"&M23)+2),(N23-$B$20)>=($S52:$W52 INDIRECT(\"CPFA50\"&M23)-12)),VLOOKUP(M23,$X$53:$Y$57,2),MAX(IF((N23-$B$20)<$S52:$W52,$S$65:$W$65,0))))))","v":0}]
[null,1,25,null,null,{"$f":"$B24*(IF(D24=\"\",0,IF(E24=\"\",VLOOKUP(D24,$X$53:$Y$57,2,TRUE),IF(AND((E24-$B$20)<($S53:$W53 INDIRECT(\"CPFA50\"&D24)+2),(E24-$B$20)>=($S53:$W53 INDIRECT(\"CPFA50\"&D24)-12)),VLOOKUP(D24,$X$53:$Y$57,2),MAX(IF((E24-$B$20)<$S53:$W53,$S$65:$W$65,0))))))","v":0},null,null,{"$f":"$B24*(IF(G24=\"\",0,IF(H24=\"\",VLOOKUP(G24,$X$53:$Y$57,2,TRUE),IF(AND((H24-$B$20)<($S53:$W53 INDIRECT(\"CPFA50\"&G24)+2),(H24-$B$20)>=($S53:$W53 INDIRECT(\"CPFA50\"&G24)-12)),VLOOKUP(G24,$X$53:$Y$57,2),MAX(IF((H24-$B$20)<$S53:$W53,$S$65:$W$65,0))))))","v":0},null,null,{"$f":"$B24*(IF(J24=\"\",0,IF(K24=\"\",VLOOKUP(J24,$X$53:$Y$57,2,TRUE),IF(AND((K24-$B$20)<($S53:$W53 INDIRECT(\"CPFA50\"&J24)+2),(K24-$B$20)>=($S53:$W53 INDIRECT(\"CPFA50\"&J24)-12)),VLOOKUP(J24,$X$53:$Y$57,2),MAX(IF((K24-$B$20)<$S53:$W53,$S$65:$W$65,0))))))","v":0},null,null,{"$f":"$B24*(IF(M24=\"\",0,IF(N24=\"\",VLOOKUP(M24,$X$53:$Y$57,2,TRUE),IF(AND((N24-$B$20)<($S53:$W53 INDIRECT(\"CPFA50\"&M24)+2),(N24-$B$20)>=($S53:$W53 INDIRECT(\"CPFA50\"&M24)-12)),VLOOKUP(M24,$X$53:$Y$57,2),MAX(IF((N24-$B$20)<$S53:$W53,$S$65:$W$65,0))))))","v":0}]
[null,2,30,null,null,{"$f":"$B25*(IF(D25=\"\",0,IF(E25=\"\",VLOOKUP(D25,$X$53:$Y$57,2,TRUE),IF(AND((E25-$B$20)<($S54:$W54 INDIRECT(\"CPFA50\"&D25)+2),(E25-$B$20)>=($S54:$W54 INDIRECT(\"CPFA50\"&D25)-12)),VLOOKUP(D25,$X$53:$Y$57,2),MAX(IF((E25-$B$20)<$S54:$W54,$S$65:$W$65,0))))))","v":0},null,null,{"$f":"$B25*(IF(G25=\"\",0,IF(H25=\"\",VLOOKUP(G25,$X$53:$Y$57,2,TRUE),IF(AND((H25-$B$20)<($S54:$W54 INDIRECT(\"CPFA50\"&G25)+2),(H25-$B$20)>=($S54:$W54 INDIRECT(\"CPFA50\"&G25)-12)),VLOOKUP(G25,$X$53:$Y$57,2),MAX(IF((H25-$B$20)<$S54:$W54,$S$65:$W$65,0))))))","v":0},null,null,{"$f":"$B25*(IF(J25=\"\",0,IF(K25=\"\",VLOOKUP(J25,$X$53:$Y$57,2,TRUE),IF(AND((K25-$B$20)<($S54:$W54 INDIRECT(\"CPFA50\"&J25)+2),(K25-$B$20)>=($S54:$W54 INDIRECT(\"CPFA50\"&J25)-12)),VLOOKUP(J25,$X$53:$Y$57,2),MAX(IF((K25-$B$20)<$S54:$W54,$S$65:$W$65,0))))))","v":0},null,null,{"$f":"$B25*(IF(M25=\"\",0,IF(N25=\"\",VLOOKUP(M25,$X$53:$Y$57,2,TRUE),IF(AND((N25-$B$20)<($S54:$W54 INDIRECT(\"CPFA50\"&M25)+2),(N25-$B$20)>=($S54:$W54 INDIRECT(\"CPFA50\"&M25)-12)),VLOOKUP(M25,$X$53:$Y$57,2),MAX(IF((N25-$B$20)<$S54:$W54,$S$65:$W$65,0))))))","v":0}]
[null,3,35,null,null,{"$f":"$B26*(IF(D26=\"\",0,IF(E26=\"\",VLOOKUP(D26,$X$53:$Y$57,2,TRUE),IF(AND((E26-$B$20)<($S55:$W55 INDIRECT(\"CPFA50\"&D26)+2),(E26-$B$20)>=($S55:$W55 INDIRECT(\"CPFA50\"&D26)-12)),VLOOKUP(D26,$X$53:$Y$57,2),MAX(IF((E26-$B$20)<$S55:$W55,$S$65:$W$65,0))))))","v":0},null,null,{"$f":"$B26*(IF(G26=\"\",0,IF(H26=\"\",VLOOKUP(G26,$X$53:$Y$57,2,TRUE),IF(AND((H26-$B$20)<($S55:$W55 INDIRECT(\"CPFA50\"&G26)+2),(H26-$B$20)>=($S55:$W55 INDIRECT(\"CPFA50\"&G26)-12)),VLOOKUP(G26,$X$53:$Y$57,2),MAX(IF((H26-$B$20)<$S55:$W55,$S$65:$W$65,0))))))","v":0},null,null,{"$f":"$B26*(IF(J26=\"\",0,IF(K26=\"\",VLOOKUP(J26,$X$53:$Y$57,2,TRUE),IF(AND((K26-$B$20)<($S55:$W55 INDIRECT(\"CPFA50\"&J26)+2),(K26-$B$20)>=($S55:$W55 INDIRECT(\"CPFA50\"&J26)-12)),VLOOKUP(J26,$X$53:$Y$57,2),MAX(IF((K26-$B$20)<$S55:$W55,$S$65:$W$65,0))))))","v":0},null,null,{"$f":"$B26*(IF(M26=\"\",0,IF(N26=\"\",VLOOKUP(M26,$X$53:$Y$57,2,TRUE),IF(AND((N26-$B$20)<($S55:$W55 INDIRECT(\"CPFA50\"&M26)+2),(N26-$B$20)>=($S55:$W55 INDIRECT(\"CPFA50\"&M26)-12)),VLOOKUP(M26,$X$53:$Y$57,2),MAX(IF((N26-$B$20)<$S55:$W55,$S$65:$W$65,0))))))","v":0}]
[null,3,40,null,null,{"$f":"$B27*(IF(D27=\"\",0,IF(E27=\"\",VLOOKUP(D27,$X$53:$Y$57,2,TRUE),IF(AND((E27-$B$20)<($S56:$W56 INDIRECT(\"CPFA50\"&D27)+2),(E27-$B$20)>=($S56:$W56 INDIRECT(\"CPFA50\"&D27)-12)),VLOOKUP(D27,$X$53:$Y$57,2),MAX(IF((E27-$B$20)<$S56:$W56,$S$65:$W$65,0))))))","v":0},null,null,{"$f":"$B27*(IF(G27=\"\",0,IF(H27=\"\",VLOOKUP(G27,$X$53:$Y$57,2,TRUE),IF(AND((H27-$B$20)<($S56:$W56 INDIRECT(\"CPFA50\"&G27)+2),(H27-$B$20)>=($S56:$W56 INDIRECT(\"CPFA50\"&G27)-12)),VLOOKUP(G27,$X$53:$Y$57,2),MAX(IF((H27-$B$20)<$S56:$W56,$S$65:$W$65,0))))))","v":0},null,null,{"$f":"$B27*(IF(J27=\"\",0,IF(K27=\"\",VLOOKUP(J27,$X$53:$Y$57,2,TRUE),IF(AND((K27-$B$20)<($S56:$W56 INDIRECT(\"CPFA50\"&J27)+2),(K27-$B$20)>=($S56:$W56 INDIRECT(\"CPFA50\"&J27)-12)),VLOOKUP(J27,$X$53:$Y$57,2),MAX(IF((K27-$B$20)<$S56:$W56,$S$65:$W$65,0))))))","v":0},null,null,{"$f":"$B27*(IF(M27=\"\",0,IF(N27=\"\",VLOOKUP(M27,$X$53:$Y$57,2,TRUE),IF(AND((N27-$B$20)<($S56:$W56 INDIRECT(\"CPFA50\"&M27)+2),(N27-$B$20)>=($S56:$W56 INDIRECT(\"CPFA50\"&M27)-12)),VLOOKUP(M27,$X$53:$Y$57,2),MAX(IF((N27-$B$20)<$S56:$W56,$S$65:$W$65,0))))))","v":0}]
[null,3,45,null,null,{"$f":"$B28*(IF(D28=\"\",0,IF(E28=\"\",VLOOKUP(D28,$X$53:$Y$57,2,TRUE),IF(AND((E28-$B$20)<($S57:$W57 INDIRECT(\"CPFA50\"&D28)+2),(E28-$B$20)>=($S57:$W57 INDIRECT(\"CPFA50\"&D28)-12)),VLOOKUP(D28,$X$53:$Y$57,2),MAX(IF((E28-$B$20)<$S57:$W57,$S$65:$W$65,0))))))","v":0},null,null,{"$f":"$B28*(IF(G28=\"\",0,IF(H28=\"\",VLOOKUP(G28,$X$53:$Y$57,2,TRUE),IF(AND((H28-$B$20)<($S57:$W57 INDIRECT(\"CPFA50\"&G28)+2),(H28-$B$20)>=($S57:$W57 INDIRECT(\"CPFA50\"&G28)-12)),VLOOKUP(G28,$X$53:$Y$57,2),MAX(IF((H28-$B$20)<$S57:$W57,$S$65:$W$65,0))))))","v":0},null,null,{"$f":"$B28*(IF(J28=\"\",0,IF(K28=\"\",VLOOKUP(J28,$X$53:$Y$57,2,TRUE),IF(AND((K28-$B$20)<($S57:$W57 INDIRECT(\"CPFA50\"&J28)+2),(K28-$B$20)>=($S57:$W57 INDIRECT(\"CPFA50\"&J28)-12)),VLOOKUP(J28,$X$53:$Y$57,2),MAX(IF((K28-$B$20)<$S57:$W57,$S$65:$W$65,0))))))","v":0},null,null,{"$f":"$B28*(IF(M28=\"\",0,IF(N28=\"\",VLOOKUP(M28,$X$53:$Y$57,2,TRUE),IF(AND((N28-$B$20)<($S57:$W57 INDIRECT(\"CPFA50\"&M28)+2),(N28-$B$20)>=($S57:$W57 INDIRECT(\"CPFA50\"&M28)-12)),VLOOKUP(M28,$X$53:$Y$57,2),MAX(IF((N28-$B$20)<$S57:$W57,$S$65:$W$65,0))))))","v":0}]
[null,2,50,null,null,{"$f":"$B29*(IF(D29=\"\",0,IF(E29=\"\",VLOOKUP(D29,$X$53:$Y$57,2,TRUE),IF(AND((E29-$B$20)<($S58:$W58 INDIRECT(\"CPFA50\"&D29)+2),(E29-$B$20)>=($S58:$W58 INDIRECT(\"CPFA50\"&D29)-12)),VLOOKUP(D29,$X$53:$Y$57,2),MAX(IF((E29-$B$20)<$S58:$W58,$S$65:$W$65,0))))))","v":0},null,null,{"$f":"$B29*(IF(G29=\"\",0,IF(H29=\"\",VLOOKUP(G29,$X$53:$Y$57,2,TRUE),IF(AND((H29-$B$20)<($S58:$W58 INDIRECT(\"CPFA50\"&G29)+2),(H29-$B$20)>=($S58:$W58 INDIRECT(\"CPFA50\"&G29)-12)),VLOOKUP(G29,$X$53:$Y$57,2),MAX(IF((H29-$B$20)<$S58:$W58,$S$65:$W$65,0))))))","v":0},null,null,{"$f":"$B29*(IF(J29=\"\",0,IF(K29=\"\",VLOOKUP(J29,$X$53:$Y$57,2,TRUE),IF(AND((K29-$B$20)<($S58:$W58 INDIRECT(\"CPFA50\"&J29)+2),(K29-$B$20)>=($S58:$W58 INDIRECT(\"CPFA50\"&J29)-12)),VLOOKUP(J29,$X$53:$Y$57,2),MAX(IF((K29-$B$20)<$S58:$W58,$S$65:$W$65,0))))))","v":0},null,null,{"$f":"$B29*(IF(M29=\"\",0,IF(N29=\"\",VLOOKUP(M29,$X$53:$Y$57,2,TRUE),IF(AND((N29-$B$20)<($S58:$W58 INDIRECT(\"CPFA50\"&M29)+2),(N29-$B$20)>=($S58:$W58 INDIRECT(\"CPFA50\"&M29)-12)),VLOOKUP(M29,$X$53:$Y$57,2),MAX(IF((N29-$B$20)<$S58:$W58,$S$65:$W$65,0))))))","v":0}]
[null,2,55,null,null,{"$f":"$B30*(IF(D30=\"\",0,IF(E30=\"\",VLOOKUP(D30,$X$53:$Y$57,2,TRUE),IF(AND((E30-$B$20)<($S59:$W59 INDIRECT(\"CPFA50\"&D30)+2),(E30-$B$20)>=($S59:$W59 INDIRECT(\"CPFA50\"&D30)-12)),VLOOKUP(D30,$X$53:$Y$57,2),MAX(IF((E30-$B$20)<$S59:$W59,$S$65:$W$65,0))))))","v":0},null,null,{"$f":"$B30*(IF(G30=\"\",0,IF(H30=\"\",VLOOKUP(G30,$X$53:$Y$57,2,TRUE),IF(AND((H30-$B$20)<($S59:$W59 INDIRECT(\"CPFA50\"&G30)+2),(H30-$B$20)>=($S59:$W59 INDIRECT(\"CPFA50\"&G30)-12)),VLOOKUP(G30,$X$53:$Y$57,2),MAX(IF((H30-$B$20)<$S59:$W59,$S$65:$W$65,0))))))","v":0},null,null,{"$f":"$B30*(IF(J30=\"\",0,IF(K30=\"\",VLOOKUP(J30,$X$53:$Y$57,2,TRUE),IF(AND((K30-$B$20)<($S59:$W59 INDIRECT(\"CPFA50\"&J30)+2),(K30-$B$20)>=($S59:$W59 INDIRECT(\"CPFA50\"&J30)-12)),VLOOKUP(J30,$X$53:$Y$57,2),MAX(IF((K30-$B$20)<$S59:$W59,$S$65:$W$65,0))))))","v":0},null,null,{"$f":"$B30*(IF(M30=\"\",0,IF(N30=\"\",VLOOKUP(M30,$X$53:$Y$57,2,TRUE),IF(AND((N30-$B$20)<($S59:$W59 INDIRECT(\"CPFA50\"&M30)+2),(N30-$B$20)>=($S59:$W59 INDIRECT(\"CPFA50\"&M30)-12)),VLOOKUP(M30,$X$53:$Y$57,2),MAX(IF((N30-$B$20)<$S59:$W59,$S$65:$W$65,0))))))","v":0}]
[null,1,60,null,null,{"$f":"$B31*(IF(D31=\"\",0,IF(E31=\"\",VLOOKUP(D31,$X$53:$Y$57,2,TRUE),IF(AND((E31-$B$20)<($S60:$W60 INDIRECT(\"CPFA50\"&D31)+2),(E31-$B$20)>=($S60:$W60 INDIRECT(\"CPFA50\"&D31)-12)),VLOOKUP(D31,$X$53:$Y$57,2),MAX(IF((E31-$B$20)<$S60:$W60,$S$65:$W$65,0))))))","v":0},null,null,{"$f":"$B31*(IF(G31=\"\",0,IF(H31=\"\",VLOOKUP(G31,$X$53:$Y$57,2,TRUE),IF(AND((H31-$B$20)<($S60:$W60 INDIRECT(\"CPFA50\"&G31)+2),(H31-$B$20)>=($S60:$W60 INDIRECT(\"CPFA50\"&G31)-12)),VLOOKUP(G31,$X$53:$Y$57,2),MAX(IF((H31-$B$20)<$S60:$W60,$S$65:$W$65,0))))))","v":0},null,null,{"$f":"$B31*(IF(J31=\"\",0,IF(K31=\"\",VLOOKUP(J31,$X$53:$Y$57,2,TRUE),IF(AND((K31-$B$20)<($S60:$W60 INDIRECT(\"CPFA50\"&J31)+2),(K31-$B$20)>=($S60:$W60 INDIRECT(\"CPFA50\"&J31)-12)),VLOOKUP(J31,$X$53:$Y$57,2),MAX(IF((K31-$B$20)<$S60:$W60,$S$65:$W$65,0))))))","v":0},null,null,{"$f":"$B31*(IF(M31=\"\",0,IF(N31=\"\",VLOOKUP(M31,$X$53:$Y$57,2,TRUE),IF(AND((N31-$B$20)<($S60:$W60 INDIRECT(\"CPFA50\"&M31)+2),(N31-$B$20)>=($S60:$W60 INDIRECT(\"CPFA50\"&M31)-12)),VLOOKUP(M31,$X$53:$Y$57,2),MAX(IF((N31-$B$20)<$S60:$W60,$S$65:$W$65,0))))))","v":0}]
[null,"RESULT",null,{"$f":"SUM(F21:F31)","v":0},null,null,{"$f":"SUM(I21:I31)","v":0},null,null,{"$f":"SUM(L21:L31)","v":0},null,null,{"$f":"SUM(O21:O31)","v":0}]
[null,null,null,"NIGHT-TIME"]
[null,null,null,"CPFA-50",null,null,"CPNA-25",null,null,"CPNA-75",null,null,"CPNCO-50"]
[null,null,null,"OEM","Vimpact","Points","OEM","Vimpact","Points","OEM","Vimpact","Points","OEM","Vimpact","Points"]
[null,1,10,null,null,{"$f":"$B36*(IF(D36=\"\",0,IF(E36=\"\",VLOOKUP(D36,$X$53:$Y$57,2,TRUE),IF(AND((E36-$B$20)<($S50:$W50 INDIRECT(\"CPFA50\"&D36)+2),(E36-$B$20)>=($S50:$W50 INDIRECT(\"CPFA50\"&D36)-12)),VLOOKUP(D36,$X$53:$Y$57,2),MAX(IF((E36-$B$20)<$S50:$W50,$S$65:$W$65,0))))))","v":0},null,null,{"$f":"$B36*(IF(G36=\"\",0,IF(H36=\"\",VLOOKUP(G36,$X$53:$Y$57,2,TRUE),IF(AND((H36-$B$20)<($S50:$W50 INDIRECT(\"CPFA50\"&G36)+2),(H36-$B$20)>=($S50:$W50 INDIRECT(\"CPFA50\"&G36)-12)),VLOOKUP(G36,$X$53:$Y$57,2),MAX(IF((H36-$B$20)<$S50:$W50,$S$65:$W$65,0))))))","v":0},null,null,{"$f":"$B36*(IF(J36=\"\",0,IF(K36=\"\",VLOOKUP(J36,$X$53:$Y$57,2,TRUE),IF(AND((K36-$B$20)<($S50:$W50 INDIRECT(\"CPFA50\"&J36)+2),(K36-$B$20)>=($S50:$W50 INDIRECT(\"CPFA50\"&J36)-12)),VLOOKUP(J36,$X$53:$Y$57,2),MAX(IF((K36-$B$20)<$S50:$W50,$S$65:$W$65,0))))))","v":0},null,null,{"$f":"$B36*(IF(M36=\"\",0,IF(N36=\"\",VLOOKUP(M36,$X$53:$Y$57,2,TRUE),IF(AND((N36-$B$20)<($S50:$W50 INDIRECT(\"CPFA50\"&M36)+2),(N36-$B$20)>=($S50:$W50 INDIRECT(\"CPFA50\"&M36)-12)),VLOOKUP(M36,$X$53:$Y$57,2),MAX(IF((N36-$B$20)<$S50:$W50,$S$65:$W$65,0))))))","v":0}]
[null,1,15,null,null,{"$f":"$B37*(IF(D37=\"\",0,IF(E37=\"\",VLOOKUP(D37,$X$53:$Y$57,2,TRUE),IF(AND((E37-$B$20)<($S51:$W51 INDIRECT(\"CPFA50\"&D37)+2),(E37-$B$20)>=($S51:$W51 INDIRECT(\"CPFA50\"&D37)-12)),VLOOKUP(D37,$X$53:$Y$57,2),MAX(IF((E37-$B$20)<$S51:$W51,$S$65:$W$65,0))))))","v":0},null,null,{"$f":"$B37*(IF(G37=\"\",0,IF(H37=\"\",VLOOKUP(G37,$X$53:$Y$57,2,TRUE),IF(AND((H37-$B$20)<($S51:$W51 INDIRECT(\"CPFA50\"&G37)+2),(H37-$B$20)>=($S51:$W51 INDIRECT(\"CPFA50\"&G37)-12)),VLOOKUP(G37,$X$53:$Y$57,2),MAX(IF((H37-$B$20)<$S51:$W51,$S$65:$W$65,0))))))","v":0},null,null,{"$f":"$B37*(IF(J37=\"\",0,IF(K37=\"\",VLOOKUP(J37,$X$53:$Y$57,2,TRUE),IF(AND((K37-$B$20)<($S51:$W51 INDIRECT(\"CPFA50\"&J37)+2),(K37-$B$20)>=($S51:$W51 INDIRECT(\"CPFA50\"&J37)-12)),VLOOKUP(J37,$X$53:$Y$57,2),MAX(IF((K37-$B$20)<$S51:$W51,$S$65:$W$65,0))))))","v":0},null,null,{"$f":"$B37*(IF(M37=\"\",0,IF(N37=\"\",VLOOKUP(M37,$X$53:$Y$57,2,TRUE),IF(AND((N37-$B$20)<($S51:$W51 INDIRECT(\"CPFA50\"&M37)+2),(N37-$B$20)>=($S51:$W51 INDIRECT(\"CPFA50\"&M37)-12)),VLOOKUP(M37,$X$53:$Y$57,2),MAX(IF((N37-$B$20)<$S51:$W51,$S$65:$W$65,0))))))","v":0}]
[null,1,20,null,null,{"$f":"$B38*(IF(D38=\"\",0,IF(E38=\"\",VLOOKUP(D38,$X$53:$Y$57,2,TRUE),IF(AND((E38-$B$20)<($S52:$W52 INDIRECT(\"CPFA50\"&D38)+2),(E38-$B$20)>=($S52:$W52 INDIRECT(\"CPFA50\"&D38)-12)),VLOOKUP(D38,$X$53:$Y$57,2),MAX(IF((E38-$B$20)<$S52:$W52,$S$65:$W$65,0))))))","v":0},null,null,{"$f":"$B38*(IF(G38=\"\",0,IF(H38=\"\",VLOOKUP(G38,$X$53:$Y$57,2,TRUE),IF(AND((H38-$B$20)<($S52:$W52 INDIRECT(\"CPFA50\"&G38)+2),(H38-$B$20)>=($S52:$W52 INDIRECT(\"CPFA50\"&G38)-12)),VLOOKUP(G38,$X$53:$Y$57,2),MAX(IF((H38-$B$20)<$S52:$W52,$S$65:$W$65,0))))))","v":0},null,null,{"$f":"$B38*(IF(J38=\"\",0,IF(K38=\"\",VLOOKUP(J38,$X$53:$Y$57,2,TRUE),IF(AND((K38-$B$20)<($S52:$W52 INDIRECT(\"CPFA50\"&J38)+2),(K38-$B$20)>=($S52:$W52 INDIRECT(\"CPFA50\"&J38)-12)),VLOOKUP(J38,$X$53:$Y$57,2),MAX(IF((K38-$B$20)<$S52:$W52,$S$65:$W$65,0))))))","v":0},null,null,{"$f":"$B38*(IF(M38=\"\",0,IF(N38=\"\",VLOOKUP(M38,$X$53:$Y$57,2,TRUE),IF(AND((N38-$B$20)<($S52:$W52 INDIRECT(\"CPFA50\"&M38)+2),(N38-$B$20)>=($S52:$W52 INDIRECT(\"CPFA50\"&M38)-12)),VLOOKUP(M38,$X$53:$Y$57,2),MAX(IF((N38-$B$20)<$S52:$W52,$S$65:$W$65,0))))))","v":0}]
[null,1,25,null,null,{"$f":"$B39*(IF(D39=\"\",0,IF(E39=\"\",VLOOKUP(D39,$X$53:$Y$57,2,TRUE),IF(AND((E39-$B$20)<($S53:$W53 INDIRECT(\"CPFA50\"&D39)+2),(E39-$B$20)>=($S53:$W53 INDIRECT(\"CPFA50\"&D39)-12)),VLOOKUP(D39,$X$53:$Y$57,2),MAX(IF((E39-$B$20)<$S53:$W53,$S$65:$W$65,0))))))","v":0},null,null,{"$f":"$B39*(IF(G39=\"\",0,IF(H39=\"\",VLOOKUP(G39,$X$53:$Y$57,2,TRUE),IF(AND((H39-$B$20)<($S53:$W53 INDIRECT(\"CPFA50\"&G39)+2),(H39-$B$20)>=($S53:$W53 INDIRECT(\"CPFA50\"&G39)-12)),VLOOKUP(G39,$X$53:$Y$57,2),MAX(IF((H39-$B$20)<$S53:$W53,$S$65:$W$65,0))))))","v":0},null,null,{"$f":"$B39*(IF(J39=\"\",0,IF(K39=\"\",VLOOKUP(J39,$X$53:$Y$57,2,TRUE),IF(AND((K39-$B$20)<($S53:$W53 INDIRECT(\"CPFA50\"&J39)+2),(K39-$B$20)>=($S53:$W53 INDIRECT(\"CPFA50\"&J39)-12)),VLOOKUP(J39,$X$53:$Y$57,2),MAX(IF((K39-$B$20)<$S53:$W53,$S$65:$W$65,0))))))","v":0},null,null,{"$f":"$B39*(IF(M39=\"\",0,IF(N39=\"\",VLOOKUP(M39,$X$53:$Y$57,2,TRUE),IF(AND((N39-$B$20)<($S53:$W53 INDIRECT(\"CPFA50\"&M39)+2),(N39-$B$20)>=($S53:$W53 INDIRECT(\"CPFA50\"&M39)-12)),VLOOKUP(M39,$X$53:$Y$57,2),MAX(IF((N39-$B$20)<$S53:$W53,$S$65:$W$65,0))))))","v":0}]
[null,1,30,null,null,{"$f":"$B40*(IF(D40=\"\",0,IF(E40=\"\",VLOOKUP(D40,$X$53:$Y$57,2,TRUE),IF(AND((E40-$B$20)<($S54:$W54 INDIRECT(\"CPFA50\"&D40)+2),(E40-$B$20)>=($S54:$W54 INDIRECT(\"CPFA50\"&D40)-12)),VLOOKUP(D40,$X$53:$Y$57,2),MAX(IF((E40-$B$20)<$S54:$W54,$S$65:$W$65,0))))))","v":0},null,null,{"$f":"$B40*(IF(G40=\"\",0,IF(H40=\"\",VLOOKUP(G40,$X$53:$Y$57,2,TRUE),IF(AND((H40-$B$20)<($S54:$W54 INDIRECT(\"CPFA50\"&G40)+2),(H40-$B$20)>=($S54:$W54 INDIRECT(\"CPFA50\"&G40)-12)),VLOOKUP(G40,$X$53:$Y$57,2),MAX(IF((H40-$B$20)<$S54:$W54,$S$65:$W$65,0))))))","v":0},null,null,{"$f":"$B40*(IF(J40=\"\",0,IF(K40=\"\",VLOOKUP(J40,$X$53:$Y$57,2,TRUE),IF(AND((K40-$B$20)<($S54:$W54 INDIRECT(\"CPFA50\"&J40)+2),(K40-$B$20)>=($S54:$W54 INDIRECT(\"CPFA50\"&J40)-12)),VLOOKUP(J40,$X$53:$Y$57,2),MAX(IF((K40-$B$20)<$S54:$W54,$S$65:$W$65,0))))))","v":0},null,null,{"$f":"$B40*(IF(M40=\"\",0,IF(N40=\"\",VLOOKUP(M40,$X$53:$Y$57,2,TRUE),IF(AND((N40-$B$20)<($S54:$W54 INDIRECT(\"CPFA50\"&M40)+2),(N40-$B$20)>=($S54:$W54 INDIRECT(\"CPFA50\"&M40)-12)),VLOOKUP(M40,$X$53:$Y$57,2),MAX(IF((N40-$B$20)<$S54:$W54,$S$65:$W$65,0))))))","v":0}]
[null,2,35,null,null,{"$f":"$B41*(IF(D41=\"\",0,IF(E41=\"\",VLOOKUP(D41,$X$53:$Y$57,2,TRUE),IF(AND((E41-$B$20)<($S55:$W55 INDIRECT(\"CPFA50\"&D41)+2),(E41-$B$20)>=($S55:$W55 INDIRECT(\"CPFA50\"&D41)-12)),VLOOKUP(D41,$X$53:$Y$57,2),MAX(IF((E41-$B$20)<$S55:$W55,$S$65:$W$65,0))))))","v":0},null,null,{"$f":"$B41*(IF(G41=\"\",0,IF(H41=\"\",VLOOKUP(G41,$X$53:$Y$57,2,TRUE),IF(AND((H41-$B$20)<($S55:$W55 INDIRECT(\"CPFA50\"&G41)+2),(H41-$B$20)>=($S55:$W55 INDIRECT(\"CPFA50\"&G41)-12)),VLOOKUP(G41,$X$53:$Y$57,2),MAX(IF((H41-$B$20)<$S55:$W55,$S$65:$W$65,0))))))","v":0},null,null,{"$f":"$B41*(IF(J41=\"\",0,IF(K41=\"\",VLOOKUP(J41,$X$53:$Y$57,2,TRUE),IF(AND((K41-$B$20)<($S55:$W55 INDIRECT(\"CPFA50\"&J41)+2),(K41-$B$20)>=($S55:$W55 INDIRECT(\"CPFA50\"&J41)-12)),VLOOKUP(J41,$X$53:$Y$57,2),MAX(IF((K41-$B$20)<$S55:$W55,$S$65:$W$65,0))))))","v":0},null,null,{"$f":"$B41*(IF(M41=\"\",0,IF(N41=\"\",VLOOKUP(M41,$X$53:$Y$57,2,TRUE),IF(AND((N41-$B$20)<($S55:$W55 INDIRECT(\"CPFA50\"&M41)+2),(N41-$B$20)>=($S55:$W55 INDIRECT(\"CPFA50\"&M41)-12)),VLOOKUP(M41,$X$53:$Y$57,2),MAX(IF((N41-$B$20)<$S55:$W55,$S$65:$W$65,0))))))","v":0}]
[null,2,40,null,null,{"$f":"$B42*(IF(D42=\"\",0,IF(E42=\"\",VLOOKUP(D42,$X$53:$Y$57,2,TRUE),IF(AND((E42-$B$20)<($S56:$W56 INDIRECT(\"CPFA50\"&D42)+2),(E42-$B$20)>=($S56:$W56 INDIRECT(\"CPFA50\"&D42)-12)),VLOOKUP(D42,$X$53:$Y$57,2),MAX(IF((E42-$B$20)<$S56:$W56,$S$65:$W$65,0))))))","v":0},null,null,{"$f":"$B42*(IF(G42=\"\",0,IF(H42=\"\",VLOOKUP(G42,$X$53:$Y$57,2,TRUE),IF(AND((H42-$B$20)<($S56:$W56 INDIRECT(\"CPFA50\"&G42)+2),(H42-$B$20)>=($S56:$W56 INDIRECT(\"CPFA50\"&G42)-12)),VLOOKUP(G42,$X$53:$Y$57,2),MAX(IF((H42-$B$20)<$S56:$W56,$S$65:$W$65,0))))))","v":0},null,null,{"$f":"$B42*(IF(J42=\"\",0,IF(K42=\"\",VLOOKUP(J42,$X$53:$Y$57,2,TRUE),IF(AND((K42-$B$20)<($S56:$W56 INDIRECT(\"CPFA50\"&J42)+2),(K42-$B$20)>=($S56:$W56 INDIRECT(\"CPFA50\"&J42)-12)),VLOOKUP(J42,$X$53:$Y$57,2),MAX(IF((K42-$B$20)<$S56:$W56,$S$65:$W$65,0))))))","v":0},null,null,{"$f":"$B42*(IF(M42=\"\",0,IF(N42=\"\",VLOOKUP(M42,$X$53:$Y$57,2,TRUE),IF(AND((N42-$B$20)<($S56:$W56 INDIRECT(\"CPFA50\"&M42)+2),(N42-$B$20)>=($S56:$W56 INDIRECT(\"CPFA50\"&M42)-12)),VLOOKUP(M42,$X$53:$Y$57,2),MAX(IF((N42-$B$20)<$S56:$W56,$S$65:$W$65,0))))))","v":0}]
[null,3,45,null,null,{"$f":"$B43*(IF(D43=\"\",0,IF(E43=\"\",VLOOKUP(D43,$X$53:$Y$57,2,TRUE),IF(AND((E43-$B$20)<($S57:$W57 INDIRECT(\"CPFA50\"&D43)+2),(E43-$B$20)>=($S57:$W57 INDIRECT(\"CPFA50\"&D43)-12)),VLOOKUP(D43,$X$53:$Y$57,2),MAX(IF((E43-$B$20)<$S57:$W57,$S$65:$W$65,0))))))","v":0},null,null,{"$f":"$B43*(IF(G43=\"\",0,IF(H43=\"\",VLOOKUP(G43,$X$53:$Y$57,2,TRUE),IF(AND((H43-$B$20)<($S57:$W57 INDIRECT(\"CPFA50\"&G43)+2),(H43-$B$20)>=($S57:$W57 INDIRECT(\"CPFA50\"&G43)-12)),VLOOKUP(G43,$X$53:$Y$57,2),MAX(IF((H43-$B$20)<$S57:$W57,$S$65:$W$65,0))))))","v":0},null,null,{"$f":"$B43*(IF(J43=\"\",0,IF(K43=\"\",VLOOKUP(J43,$X$53:$Y$57,2,TRUE),IF(AND((K43-$B$20)<($S57:$W57 INDIRECT(\"CPFA50\"&J43)+2),(K43-$B$20)>=($S57:$W57 INDIRECT(\"CPFA50\"&J43)-12)),VLOOKUP(J43,$X$53:$Y$57,2),MAX(IF((K43-$B$20)<$S57:$W57,$S$65:$W$65,0))))))","v":0},null,null,{"$f":"$B43*(IF(M43=\"\",0,IF(N43=\"\",VLOOKUP(M43,$X$53:$Y$57,2,TRUE),IF(AND((N43-$B$20)<($S57:$W57 INDIRECT(\"CPFA50\"&M43)+2),(N43-$B$20)>=($S57:$W57 INDIRECT(\"CPFA50\"&M43)-12)),VLOOKUP(M43,$X$53:$Y$57,2),MAX(IF((N43-$B$20)<$S57:$W57,$S$65:$W$65,0))))))","v":0}]
[null,3,50,null,null,{"$f":"$B44*(IF(D44=\"\",0,IF(E44=\"\",VLOOKUP(D44,$X$53:$Y$57,2,TRUE),IF(AND((E44-$B$20)<($S58:$W58 INDIRECT(\"CPFA50\"&D44)+2),(E44-$B$20)>=($S58:$W58 INDIRECT(\"CPFA50\"&D44)-12)),VLOOKUP(D44,$X$53:$Y$57,2),MAX(IF((E44-$B$20)<$S58:$W58,$S$65:$W$65,0))))))","v":0},null,null,{"$f":"$B44*(IF(G44=\"\",0,IF(H44=\"\",VLOOKUP(G44,$X$53:$Y$57,2,TRUE),IF(AND((H44-$B$20)<($S58:$W58 INDIRECT(\"CPFA50\"&G44)+2),(H44-$B$20)>=($S58:$W58 INDIRECT(\"CPFA50\"&G44)-12)),VLOOKUP(G44,$X$53:$Y$57,2),MAX(IF((H44-$B$20)<$S58:$W58,$S$65:$W$65,0))))))","v":0},null,null,{"$f":"$B44*(IF(J44=\"\",0,IF(K44=\"\",VLOOKUP(J44,$X$53:$Y$57,2,TRUE),IF(AND((K44-$B$20)<($S58:$W58 INDIRECT(\"CPFA50\"&J44)+2),(K44-$B$20)>=($S58:$W58 INDIRECT(\"CPFA50\"&J44)-12)),VLOOKUP(J44,$X$53:$Y$57,2),MAX(IF((K44-$B$20)<$S58:$W58,$S$65:$W$65,0))))))","v":0},null,null,{"$f":"$B44*(IF(M44=\"\",0,IF(N44=\"\",VLOOKUP(M44,$X$53:$Y$57,2,TRUE),IF(AND((N44-$B$20)<($S58:$W58 INDIRECT(\"CPFA50\"&M44)+2),(N44-$B$20)>=($S58:$W58 INDIRECT(\"CPFA50\"&M44)-12)),VLOOKUP(M44,$X$53:$Y$57,2),MAX(IF((N44-$B$20)<$S58:$W58,$S$65:$W$65,0))))))","v":0}]
[null,3,55,null,null,{"$f":"$B45*(IF(D45=\"\",0,IF(E45=\"\",VLOOKUP(D45,$X$53:$Y$57,2,TRUE),IF(AND((E45-$B$20)<($S59:$W59 INDIRECT(\"CPFA50\"&D45)+2),(E45-$B$20)>=($S59:$W59 INDIRECT(\"CPFA50\"&D45)-12)),VLOOKUP(D45,$X$53:$Y$57,2),MAX(IF((E45-$B$20)<$S59:$W59,$S$65:$W$65,0))))))","v":0},null,null,{"$f":"$B45*(IF(G45=\"\",0,IF(H45=\"\",VLOOKUP(G45,$X$53:$Y$57,2,TRUE),IF(AND((H45-$B$20)<($S59:$W59 INDIRECT(\"CPFA50\"&G45)+2),(H45-$B$20)>=($S59:$W59 INDIRECT(\"CPFA50\"&G45)-12)),VLOOKUP(G45,$X$53:$Y$57,2),MAX(IF((H45-$B$20)<$S59:$W59,$S$65:$W$65,0))))))","v":0},null,null,{"$f":"$B45*(IF(J45=\"\",0,IF(K45=\"\",VLOOKUP(J45,$X$53:$Y$57,2,TRUE),IF(AND((K45-$B$20)<($S59:$W59 INDIRECT(\"CPFA50\"&J45)+2),(K45-$B$20)>=($S59:$W59 INDIRECT(\"CPFA50\"&J45)-12)),VLOOKUP(J45,$X$53:$Y$57,2),MAX(IF((K45-$B$20)<$S59:$W59,$S$65:$W$65,0))))))","v":0},null,null,{"$f":"$B45*(IF(M45=\"\",0,IF(N45=\"\",VLOOKUP(M45,$X$53:$Y$57,2,TRUE),IF(AND((N45-$B$20)<($S59:$W59 INDIRECT(\"CPFA50\"&M45)+2),(N45-$B$20)>=($S59:$W59 INDIRECT(\"CPFA50\"&M45)-12)),VLOOKUP(M45,$X$53:$Y$57,2),MAX(IF((N45-$B$20)<$S59:$W59,$S$65:$W$65,0))))))","v":0}]
[null,2,60,null,null,{"$f":"$B46*(IF(D46=\"\",0,IF(E46=\"\",VLOOKUP(D46,$X$53:$Y$57,2,TRUE),IF(AND((E46-$B$20)<($S60:$W60 INDIRECT(\"CPFA50\"&D46)+2),(E46-$B$20)>=($S60:$W60 INDIRECT(\"CPFA50\"&D46)-12)),VLOOKUP(D46,$X$53:$Y$57,2),MAX(IF((E46-$B$20)<$S60:$W60,$S$65:$W$65,0))))))","v":0},null,null,{"$f":"$B46*(IF(G46=\"\",0,IF(H46=\"\",VLOOKUP(G46,$X$53:$Y$57,2,TRUE),IF(AND((H46-$B$20)<($S60:$W60 INDIRECT(\"CPFA50\"&G46)+2),(H46-$B$20)>=($S60:$W60 INDIRECT(\"CPFA50\"&G46)-12)),VLOOKUP(G46,$X$53:$Y$57,2),MAX(IF((H46-$B$20)<$S60:$W60,$S$65:$W$65,0))))))","v":0},null,null,{"$f":"$B46*(IF(J46=\"\",0,IF(K46=\"\",VLOOKUP(J46,$X$53:$Y$57,2,TRUE),IF(AND((K46-$B$20)<($S60:$W60 INDIRECT(\"CPFA50\"&J46)+2),(K46-$B$20)>=($S60:$W60 INDIRECT(\"CPFA50\"&J46)-12)),VLOOKUP(J46,$X$53:$Y$57,2),MAX(IF((K46-$B$20)<$S60:$W60,$S$65:$W$65,0))))))","v":0},null,null,{"$f":"$B46*(IF(M46=\"\",0,IF(N46=\"\",VLOOKUP(M46,$X$53:$Y$57,2,TRUE),IF(AND((N46-$B$20)<($S60:$W60 INDIRECT(\"CPFA50\"&M46)+2),(N46-$B$20)>=($S60:$W60 INDIRECT(\"CPFA50\"&M46)-12)),VLOOKUP(M46,$X$53:$Y$57,2),MAX(IF((N46-$B$20)<$S60:$W60,$S$65:$W$65,0))))))","v":0}]
[null,"RESULT",null,{"$f":"SUM(F36:F46)","v":0},null,null,{"$f":"SUM(I36:I46)","v":0},null,null,{"$f":"SUM(L36:L46)","v":0},null,null,{"$f":"SUM(O36:O46)","v":0}]
[]
[null,"LONGITUDINAL",null,"DAYTIME",null,null,null,null,null,"NIGHT-TIME",null,null,null,null,null,null,null,null,"Green","Yellow","Orange","Brown","Red"]
[null,null,null,"CPLA-50",null,null,"CPLA-25",null,null,"CPLA-50",null,null,"CPLA-25",null,null,null,null,10,0,null,null,null,10]
[null,5,"<--Target speed for relative impact speed judgement","OEM","Vimpact","Points","TTCFCW",null,"Points","OEM","Vimpact","Points","TTCFCW",null,"Points",null,null,15,0,null,null,10,15]
[null,1,20,null,null,{"$f":"$B52*(IF(D52=\"\",0,IF(E52=\"\",VLOOKUP(D52,$X$53:$Y$57,2,TRUE),IF(AND((E52-$B$51)<($S52:$W52 INDIRECT(\"CPLA50\"&D52)+2),(E52-$B$51)>=($S52:$W52 INDIRECT(\"CPLA50\"&D52)-12)),VLOOKUP(D52,$X$53:$Y$57,2),MAX(IF((E52-$B$51)<$S52:$W52,$S$65:$W$65,0))))))","v":0},null,null,null,null,null,{"$f":"$B52*(IF(J52=\"\",0,IF(K52=\"\",VLOOKUP(J52,$X$53:$Y$57,2,TRUE),IF(AND((K52-5)<($S52:$W52 INDIRECT(\"CPLA50\"&J52)+2),(K52-5)>=($S52:$W52 INDIRECT(\"CPLA50\"&J52)-12)),VLOOKUP(J52,$X$53:$Y$57,2),MAX(IF((K52-5)<$S52:$W52,$S$65:$W$65,0))))))","v":0},null,null,null,null,null,20,0,null,null,10,{"$f":"R52","v":20}]
[null,1,25,null,null,{"$f":"$B53*(IF(D53=\"\",0,IF(E53=\"\",VLOOKUP(D53,$X$53:$Y$57,2,TRUE),IF(AND((E53-$B$51)<($S53:$W53 INDIRECT(\"CPLA50\"&D53)+2),(E53-$B$51)>=($S53:$W53 INDIRECT(\"CPLA50\"&D53)-12)),VLOOKUP(D53,$X$53:$Y$57,2),MAX(IF((E53-$B$51)<$S53:$W53,$S$65:$W$65,0))))))","v":0},null,null,null,null,null,{"$f":"$B53*(IF(J53=\"\",0,IF(K53=\"\",VLOOKUP(J53,$X$53:$Y$57,2,TRUE),IF(AND((K53-5)<($S53:$W53 INDIRECT(\"CPLA50\"&J53)+2),(K53-5)>=($S53:$W53 INDIRECT(\"CPLA50\"&J53)-12)),VLOOKUP(J53,$X$53:$Y$57,2),MAX(IF((K53-5)<$S53:$W53,$S$65:$W$65,0))))))","v":0},null,null,null,null,null,25,0,null,10,20,{"$f":"R53","v":25},"Brown",0.25]
[null,1,30,null,null,{"$f":"$B54*(IF(D54=\"\",0,IF(E54=\"\",VLOOKUP(D54,$X$53:$Y$57,2,TRUE),IF(AND((E54-$B$51)<($S54:$W54 INDIRECT(\"CPLA50\"&D54)+2),(E54-$B$51)>=($S54:$W54 INDIRECT(\"CPLA50\"&D54)-12)),VLOOKUP(D54,$X$53:$Y$57,2),MAX(IF((E54-$B$51)<$S54:$W54,$S$65:$W$65,0))))))","v":0},null,null,null,null,null,{"$f":"$B54*(IF(J54=\"\",0,IF(K54=\"\",VLOOKUP(J54,$X$53:$Y$57,2,TRUE),IF(AND((K54-5)<($S54:$W54 INDIRECT(\"CPLA50\"&J54)+2),(K54-5)>=($S54:$W54 INDIRECT(\"CPLA50\"&J54)-12)),VLOOKUP(J54,$X$53:$Y$57,2),MAX(IF((K54-5)<$S54:$W54,$S$65:$W$65,0))))))","v":0},null,null,null,null,null,30,0,null,10,20,30,"Green",1]
[null,2,35,null,null,{"$f":"$B55*(IF(D55=\"\",0,IF(E55=\"\",VLOOKUP(D55,$X$53:$Y$57,2,TRUE),IF(AND((E55-$B$51)<($S55:$W55 INDIRECT(\"CPLA50\"&D55)+2),(E55-$B$51)>=($S55:$W55 INDIRECT(\"CPLA50\"&D55)-12)),VLOOKUP(D55,$X$53:$Y$57,2),MAX(IF((E55-$B$51)<$S55:$W55,$S$65:$W$65,0))))))","v":0},null,null,null,null,null,{"$f":"$B55*(IF(J55=\"\",0,IF(K55=\"\",VLOOKUP(J55,$X$53:$Y$57,2,TRUE),IF(AND((K55-5)<($S55:$W55 INDIRECT(\"CPLA50\"&J55)+2),(K55-5)>=($S55:$W55 INDIRECT(\"CPLA50\"&J55)-12)),VLOOKUP(J55,$X$53:$Y$57,2),MAX(IF((K55-5)<$S55:$W55,$S$65:$W$65,0))))))","v":0},null,null,null,null,null,35,0,10,20,30,35,"Orange",0.5]
[null,2,40,null,null,{"$f":"$B56*(IF(D56=\"\",0,IF(E56=\"\",VLOOKUP(D56,$X$53:$Y$57,2,TRUE),IF(AND((E56-$B$51)<($S56:$W56 INDIRECT(\"CPLA50\"&D56)+2),(E56-$B$51)>=($S56:$W56 INDIRECT(\"CPLA50\"&D56)-12)),VLOOKUP(D56,$X$53:$Y$57,2),MAX(IF((E56-$B$51)<$S56:$W56,$S$65:$W$65,0))))))","v":0},null,null,null,null,null,{"$f":"$B56*(IF(J56=\"\",0,IF(K56=\"\",VLOOKUP(J56,$X$53:$Y$57,2,TRUE),IF(AND((K56-5)<($S56:$W56 INDIRECT(\"CPLA50\"&J56)+2),(K56-5)>=($S56:$W56 INDIRECT(\"CPLA50\"&J56)-12)),VLOOKUP(J56,$X$53:$Y$57,2),MAX(IF((K56-5)<$S56:$W56,$S$65:$W$65,0))))))","v":0},null,null,null,null,null,40,0,10,20,30,40,"Red",0]
[null,3,45,null,null,{"$f":"$B57*(IF(D57=\"\",0,IF(E57=\"\",VLOOKUP(D57,$X$53:$Y$57,2,TRUE),IF(AND((E57-$B$51)<($S57:$W57 INDIRECT(\"CPLA50\"&D57)+2),(E57-$B$51)>=($S57:$W57 INDIRECT(\"CPLA50\"&D57)-12)),VLOOKUP(D57,$X$53:$Y$57,2),MAX(IF((E57-$B$51)<$S57:$W57,$S$65:$W$65,0))))))","v":0},null,null,null,null,null,{"$f":"$B57*(IF(J57=\"\",0,IF(K57=\"\",VLOOKUP(J57,$X$53:$Y$57,2,TRUE),IF(AND((K57-5)<($S57:$W57 INDIRECT(\"CPLA50\"&J57)+2),(K57-5)>=($S57:$W57 INDIRECT(\"CPLA50\"&J57)-12)),VLOOKUP(J57,$X$53:$Y$57,2),MAX(IF((K57-5)<$S57:$W57,$S$65:$W$65,0))))))","v":0},null,null,null,null,null,45,0,10,20,30,45,"Yellow",0.75]
[null,3,50,null,null,{"$f":"$B58*(IF(D58=\"\",0,IF(E58=\"\",VLOOKUP(D58,$X$53:$Y$57,2,TRUE),IF(AND((E58-$B$51)<($S58:$W58 INDIRECT(\"CPLA50\"&D58)+2),(E58-$B$51)>=($S58:$W58 INDIRECT(\"CPLA50\"&D58)-12)),VLOOKUP(D58,$X$53:$Y$57,2),MAX(IF((E58-$B$51)<$S58:$W58,$S$65:$W$65,0))))))","v":0},null,null,{"$f":"IF(G58=\"\",0,IF(G58>=1.7,$B58,0))","v":0},null,null,{"$f":"$B58*(IF(J58=\"\",0,IF(K58=\"\",VLOOKUP(J58,$X$53:$Y$57,2,TRUE),IF(AND((K58-5)<($S58:$W58 INDIRECT(\"CPLA50\"&J58)+2),(K58-5)>=($S58:$W58 INDIRECT(\"CPLA50\"&J58)-12)),VLOOKUP(J58,$X$53:$Y$57,2),MAX(IF((K58-5)<$S58:$W58,$S$65:$W$65,0))))))","v":0},null,null,{"$f":"IF(M58=\"\",0,IF(M58>=1.7,$B58,0))","v":0},null,null,50,0,10,20,30,50]
[null,3,55,null,null,{"$f":"$B59*(IF(D59=\"\",0,IF(E59=\"\",VLOOKUP(D59,$X$53:$Y$57,2,TRUE),IF(AND((E59-$B$51)<($S59:$W59 INDIRECT(\"CPLA50\"&D59)+2),(E59-$B$51)>=($S59:$W59 INDIRECT(\"CPLA50\"&D59)-12)),VLOOKUP(D59,$X$53:$Y$57,2),MAX(IF((E59-$B$51)<$S59:$W59,$S$65:$W$65,0))))))","v":0},null,null,{"$f":"IF(G59=\"\",0,IF(G59>=1.7,$B59,0))","v":0},null,null,{"$f":"$B59*(IF(J59=\"\",0,IF(K59=\"\",VLOOKUP(J59,$X$53:$Y$57,2,TRUE),IF(AND((K59-5)<($S59:$W59 INDIRECT(\"CPLA50\"&J59)+2),(K59-5)>=($S59:$W59 INDIRECT(\"CPLA50\"&J59)-12)),VLOOKUP(J59,$X$53:$Y$57,2),MAX(IF((K59-5)<$S59:$W59,$S$65:$W$65,0))))))","v":0},null,null,{"$f":"IF(M59=\"\",0,IF(M59>=1.7,$B59,0))","v":0},null,null,55,0,10,20,30,55]
[null,2,60,null,null,{"$f":"$B60*(IF(D60=\"\",0,IF(E60=\"\",VLOOKUP(D60,$X$53:$Y$57,2,TRUE),IF(AND((E60-$B$51)<($S60:$W60 INDIRECT(\"CPLA50\"&D60)+2),(E60-$B$51)>=($S60:$W60 INDIRECT(\"CPLA50\"&D60)-12)),VLOOKUP(D60,$X$53:$Y$57,2),MAX(IF((E60-$B$51)<$S60:$W60,$S$65:$W$65,0))))))","v":0},null,null,0,null,null,{"$f":"$B60*(IF(J60=\"\",0,IF(K60=\"\",VLOOKUP(J60,$X$53:$Y$57,2,TRUE),IF(AND((K60-5)<($S60:$W60 INDIRECT(\"CPLA50\"&J60)+2),(K60-5)>=($S60:$W60 INDIRECT(\"CPLA50\"&J60)-12)),VLOOKUP(J60,$X$53:$Y$57,2),MAX(IF((K60-5)<$S60:$W60,$S$65:$W$65,0))))))","v":0},null,null,0,null,null,60,0,10,20,30,60]
[null,1,65,null,null,null,null,null,0,null,null,null,null,null,0,null,null,65]
[null,1,70,null,null,null,null,null,0,null,null,null,null,null,0,null,null,70]
[null,1,75,null,null,null,null,null,0,null,null,null,null,null,0,null,null,75]
[null,1,80,null,null,null,null,null,0,null,null,null,null,null,0,null,null,80]
[null,"RESULT",null,{"$f":"SUM(F52:F60)","v":0},null,null,{"$f":"SUM(I58:I64)","v":0},null,null,{"$f":"SUM(L52:L60)","v":0},null,null,{"$f":"SUM(O58:O64)","v":0},null,null,null,null,null,1,0.75,0.5,0.25,0]
[]
[null,"TURNING",null,"DAYTIME"]
[null,null,null,"CPTA-50 farside opposite",null,null,"CPTA-50 nearside opposite",null,null,"CPTA-50 farside same",null,null,"CPTA-50 nearside same"]
[null,null,null,"Vimpact",null,"Points","Vimpact",null,"Points","Vimpact",null,"Points","Vimpact",null,"Points"]
[null,1,10,null,null,{"$f":"IF(D70=\"\",0,IF(D70=0,1,0))","v":0},null,null,{"$f":"IF(G70=\"\",0,IF(G70=0,1,0))","v":0},null,null,{"$f":"IF(J70=\"\",0,IF(J70=0,1,0))","v":0},null,null,{"$f":"IF(M70=\"\",0,IF(M70=0,1,0))","v":0}]
[null,1,15,null,null,{"$f":"IF(D71=\"\",0,IF(D71=0,1,0))","v":0},null,null,null,null,null,{"$f":"IF(J71=\"\",0,IF(J71=0,1,0))","v":0}]
[null,1,20,null,null,{"$f":"IF(D72=\"\",0,IF(D72=0,1,0))","v":0},null,null,null,null,null,{"$f":"IF(J72=\"\",0,IF(J72=0,1,0))","v":0}]
[null,"RESULT",null,{"$f":"SUM(F70:F72,I70)","v":0},null,null,null,null,null,{"$f":"SUM(L70:L72,O70)","v":0}]
[]
[null,"REVERSE",null,"DAYTIME"]
[null,null,null,"CPRs-25",null,null,"CPRs-50",null,null,"CPRs-75",null,null,"CPRm-50"]
[null,null,null,"Vimpact",null,"Points","Vimpact",null,"Points","Vimpact",null,"Points","Vimpact",null,"Points"]
[null,1,4,null,null,{"$f":"IF(D78=\"\",\"Fail\",IF(D78=0,\"Pass\",\"Fail\"))","v":"Fail"},null,null,{"$f":"IF(G78=\"\",\"Fail\",IF(G78=0,\"Pass\",\"Fail\"))","v":"Fail"},null,null,{"$f":"IF(J78=\"\",\"Fail\",IF(J78=0,\"Pass\",\"Fail\"))","v":"Fail"},null,null,{"$f":"IF(M78=\"\",0,IF(M78=0,1,0))","v":0}]
[null,1,8,null,null,{"$f":"IF(D79=\"\",\"Fail\",IF(D79=0,\"Pass\",\"Fail\"))","v":"Fail"},null,null,{"$f":"IF(G79=\"\",\"Fail\",IF(G79=0,\"Pass\",\"Fail\"))","v":"Fail"},null,null,{"$f":"IF(J79=\"\",\"Fail\",IF(J79=0,\"Pass\",\"Fail\"))","v":"Fail"},null,null,{"$f":"IF(M79=\"\",0,IF(M79=0,1,0))","v":0}]
[null,null,"System does NOT release brakes unless path is clear?","PASS"]
[null,"RESULT",null,{"$f":"IF(AND(D80=\"PASS\",F78=\"Pass\",I78=\"Pass\",L78=\"Pass\"),1,0)+IF(AND(D80=\"PASS\",F79=\"Pass\",I79=\"Pass\",L79=\"Pass\"),1,0)","v":0},null,null,null,null,null,null,null,null,{"$f":"IF(D80=\"PASS\",SUM(O78:O79))","v":0}]
[]
[null,"SUMMARY",null,"DAYTIME",null,null,null,null,null,"NIGHT-TIME"]
[null,null,null,null,null,null,"Points",null,null,null,null,null,"Points"]
[null,null,"CPFA-50",{"$f":"ROUND(D32/20,Round)","v":0},null,null,{"$f":"D85*0.25","v":0},null,null,{"$f":"ROUND(D47/20,Round)","v":0},null,null,{"$f":"J85*0.75","v":0}]
[null,null,"CPNA-25",{"$f":"ROUND(G32/20,Round)","v":0},null,null,{"$f":"D86*0.125","v":0},null,null,{"$f":"ROUND(G47/20,Round)","v":0},null,null,{"$f":"J86*0.375","v":0}]
[null,null,"CPNA-75",{"$f":"ROUND(J32/20,Round)","v":0},null,null,{"$f":"D87*0.125","v":0},null,null,{"$f":"ROUND(J47/20,Round)","v":0},null,null,{"$f":"J87*0.375","v":0}]
[null,null,"CPNCO-50",{"$f":"ROUND(M32/20,Round)","v":0},null,null,{"$f":"D88*1","v":0},null,null,{"$f":"ROUND(M47/20,Round)","v":0},null,null,{"$f":"J88*0.5","v":0}]
[null,null,"CPLA",{"$f":"ROUND((D65+G65)/30,Round)","v":0},null,null,{"$f":"D89*0.5","v":0},null,null,{"$f":"ROUND((J65+M65)/30,Round)","v":0},null,null,{"$f":"J89*1","v":0}]
[null,null,"CPTA",{"$f":"ROUND((D73+J73)/8,Round)","v":0},null,null,{"$f":"D90*2","v":0}]
[null,null,"CPRA",{"$f":"ROUND((D81+M81)/4,Round)","v":0},null,null,{"$f":"D91*2","v":0}]
[null,"TOTAL",null,{"$f":"SUM(G85:I91)","v":0},null,null,null,null,null,{"$f":"SUM(M85:O89)","v":0}]
[]
[null,"TOTAL AEB Pedestrian",null,{"$f":"IF(NOT(D16=\"PASS\"),0,SUM(D92:O92))","v":0}]

{"sheet":"VRU AEB Bicyclist","index":17,"n_rows":76,"n_cols":24,"rows_kept":76,"cut":false,"hidden":false,"merged":[[70,3,70,5],[65,1,65,2],[65,3,65,8],[73,1,73,2],[73,3,73,8],[68,3,68,5],[68,6,68,8],[69,3,69,5],[69,6,69,8],[70,6,70,8],[66,3,66,5],[66,6,66,8],[67,3,67,5],[67,6,67,8],[75,1,75,2],[71,3,71,5],[71,6,71,8],[72,3,72,5],[72,6,72,8],[75,3,75,8],[46,3,46,5],[46,6,46,7],[55,1,55,2],[55,3,55,8],[50,3,50,5],[50,6,50,8],[51,3,51,4],[51,6,51,7],[53,3,53,4],[53,6,53,8],[54,3,54,4],[54,6,54,8],[52,3,52,4],[52,6,52,7],[43,3,43,5],[43,6,43,7],[44,3,44,5],[44,6,44,7],[45,3,45,5],[45,6,45,7],[30,9,30,11],[42,6,42,7],[36,6,36,8],[37,6,37,8],[38,6,38,8],[34,6,34,7],[35,6,35,8],[32,3,32,8],[33,3,33,5],[33,6,33,8],[39,6,39,8],[40,6,40,7],[41,6,41,7],[17,9,17,11],[1,1,2,2],[3,1,3,2],[14,1,14,2],[16,3,16,11],[13,3,13,11],[12,3,12,11],[14,3,14,11],[10,3,10,11],[11,3,11,11],[1,3,3,11],[8,3,8,11],[7,3,7,11],[6,3,6,11],[5,3,5,11],[4,3,4,11],[58,6,60,8],[61,6,62,7],[63,1,63,2],[58,3,58,5],[17,3,17,5],[17,6,17,8],[57,3,57,8],[63,3,63,8],[49,3,49,8],[61,8,62,8],[30,1,30,2],[30,3,30,5],[30,6,30,8],[47,1,47,2],[47,3,47,5],[47,6,47,8]]}
[3]
[null,"AEB Bicyclist"]
[]
[null,{"$f":"'General Overview'!G12","v":""}]
[null,"SYSTEM DETAILS"]
[null,null,"System Name"]
[null,null,"Functionality"]
[null,null,"Speed range (km/h) - Minimum"]
[null,null,"Maximum"]
[]
[null,"PREREQUISITES"]
[]
[null,null,"Default ON"]
[null,null,"System switches off below 80 km/h"]
[null,"PREREQUISITES",null,{"$f":"IF(AND(D13=\"YES\",D14=\"NO\",SUM('OVERALL RATING'!H7:H10)>18),\"PASS\",\"FAIL\")","v":"FAIL"}]
[]
[null,"CROSSING",null,"DAYTIME"]
[null,null,null,"CBFA-50",null,null,"CBNA-50",null,null,"CBNAO-50"]
[null,0,"<--Target speed for relative impact speed judgement","OEM","Vimpact","Points","OEM","Vimpact","Points","OEM","Vimpact","Points"]
[null,1,10,null,null,{"$f":"$B20*(IF(D20=\"\",0,IF(E20=\"\",VLOOKUP(D20,$W$36:$X$40,2,TRUE),IF(AND((E20-$B$19)<($R33:$V33 INDIRECT(\"CBFA50\"&D20)+2),(E20-$B$19)>=($R33:$V33 INDIRECT(\"CBFA50\"&D20)-12)),VLOOKUP(D20,$W$36:$X$40,2),MAX(IF((E20-$B$19)<$R33:$V33,$R$48:$V$48,0))))))","v":0},null,null,{"$f":"$B20*(IF(G20=\"\",0,IF(H20=\"\",VLOOKUP(G20,$W$36:$X$40,2,TRUE),IF(AND((H20-$B$19)<($R33:$V33 INDIRECT(\"CBFA50\"&G20)+2),(H20-$B$19)>=($R33:$V33 INDIRECT(\"CBFA50\"&G20)-12)),VLOOKUP(G20,$W$36:$X$40,2),MAX(IF((H20-$B$19)<$R33:$V33,$R$48:$V$48,0))))))","v":0},null,null,{"$f":"$B20*(IF(J20=\"\",0,IF(K20=\"\",VLOOKUP(J20,$W$36:$X$40,2,TRUE),IF(AND((K20-$B$19)<($R33:$V33 INDIRECT(\"CBFA50\"&J20)+2),(K20-$B$19)>=($R33:$V33 INDIRECT(\"CBFA50\"&J20)-12)),VLOOKUP(J20,$W$36:$X$40,2),MAX(IF((K20-$B$19)<$R33:$V33,$R$48:$V$48,0))))))","v":0}]
[null,1,15,null,null,{"$f":"$B21*(IF(D21=\"\",0,IF(E21=\"\",VLOOKUP(D21,$W$36:$X$40,2,TRUE),IF(AND((E21-$B$19)<($R34:$V34 INDIRECT(\"CBFA50\"&D21)+2),(E21-$B$19)>=($R34:$V34 INDIRECT(\"CBFA50\"&D21)-12)),VLOOKUP(D21,$W$36:$X$40,2),MAX(IF((E21-$B$19)<$R34:$V34,$R$48:$V$48,0))))))","v":0},null,null,{"$f":"$B21*(IF(G21=\"\",0,IF(H21=\"\",VLOOKUP(G21,$W$36:$X$40,2,TRUE),IF(AND((H21-$B$19)<($R34:$V34 INDIRECT(\"CBFA50\"&G21)+2),(H21-$B$19)>=($R34:$V34 INDIRECT(\"CBFA50\"&G21)-12)),VLOOKUP(G21,$W$36:$X$40,2),MAX(IF((H21-$B$19)<$R34:$V34,$R$48:$V$48,0))))))","v":0},null,null,{"$f":"$B21*(IF(J21=\"\",0,IF(K21=\"\",VLOOKUP(J21,$W$36:$X$40,2,TRUE),IF(AND((K21-$B$19)<($R34:$V34 INDIRECT(\"CBFA50\"&J21)+2),(K21-$B$19)>=($R34:$V34 INDIRECT(\"CBFA50\"&J21)-12)),VLOOKUP(J21,$W$36:$X$40,2),MAX(IF((K21-$B$19)<$R34:$V34,$R$48:$V$48,0))))))","v":0}]
[null,1,20,null,null,{"$f":"$B22*(IF(D22=\"\",0,IF(E22=\"\",VLOOKUP(D22,$W$36:$X$40,2,TRUE),IF(AND((E22-$B$19)<($R35:$V35 INDIRECT(\"CBFA50\"&D22)+2),(E22-$B$19)>=($R35:$V35 INDIRECT(\"CBFA50\"&D22)-12)),VLOOKUP(D22,$W$36:$X$40,2),MAX(IF((E22-$B$19)<$R35:$V35,$R$48:$V$48,0))))))","v":0},null,null,{"$f":"$B22*(IF(G22=\"\",0,IF(H22=\"\",VLOOKUP(G22,$W$36:$X$40,2,TRUE),IF(AND((H22-$B$19)<($R35:$V35 INDIRECT(\"CBFA50\"&G22)+2),(H22-$B$19)>=($R35:$V35 INDIRECT(\"CBFA50\"&G22)-12)),VLOOKUP(G22,$W$36:$X$40,2),MAX(IF((H22-$B$19)<$R35:$V35,$R$48:$V$48,0))))))","v":0},null,null,{"$f":"$B22*(IF(J22=\"\",0,IF(K22=\"\",VLOOKUP(J22,$W$36:$X$40,2,TRUE),IF(AND((K22-$B$19)<($R35:$V35 INDIRECT(\"CBFA50\"&J22)+2),(K22-$B$19)>=($R35:$V35 INDIRECT(\"CBFA50\"&J22)-12)),VLOOKUP(J22,$W$36:$X$40,2),MAX(IF((K22-$B$19)<$R35:$V35,$R$48:$V$48,0))))))","v":0}]
[null,1,25,null,null,{"$f":"$B23*(IF(D23=\"\",0,IF(E23=\"\",VLOOKUP(D23,$W$36:$X$40,2,TRUE),IF(AND((E23-$B$19)<($R36:$V36 INDIRECT(\"CBFA50\"&D23)+2),(E23-$B$19)>=($R36:$V36 INDIRECT(\"CBFA50\"&D23)-12)),VLOOKUP(D23,$W$36:$X$40,2),MAX(IF((E23-$B$19)<$R36:$V36,$R$48:$V$48,0))))))","v":0},null,null,{"$f":"$B23*(IF(G23=\"\",0,IF(H23=\"\",VLOOKUP(G23,$W$36:$X$40,2,TRUE),IF(AND((H23-$B$19)<($R36:$V36 INDIRECT(\"CBFA50\"&G23)+2),(H23-$B$19)>=($R36:$V36 INDIRECT(\"CBFA50\"&G23)-12)),VLOOKUP(G23,$W$36:$X$40,2),MAX(IF((H23-$B$19)<$R36:$V36,$R$48:$V$48,0))))))","v":0},null,null,{"$f":"$B23*(IF(J23=\"\",0,IF(K23=\"\",VLOOKUP(J23,$W$36:$X$40,2,TRUE),IF(AND((K23-$B$19)<($R36:$V36 INDIRECT(\"CBFA50\"&J23)+2),(K23-$B$19)>=($R36:$V36 INDIRECT(\"CBFA50\"&J23)-12)),VLOOKUP(J23,$W$36:$X$40,2),MAX(IF((K23-$B$19)<$R36:$V36,$R$48:$V$48,0))))))","v":0}]
[null,1,30,null,null,{"$f":"$B24*(IF(D24=\"\",0,IF(E24=\"\",VLOOKUP(D24,$W$36:$X$40,2,TRUE),IF(AND((E24-$B$19)<($R37:$V37 INDIRECT(\"CBFA50\"&D24)+2),(E24-$B$19)>=($R37:$V37 INDIRECT(\"CBFA50\"&D24)-12)),VLOOKUP(D24,$W$36:$X$40,2),MAX(IF((E24-$B$19)<$R37:$V37,$R$48:$V$48,0))))))","v":0},null,null,{"$f":"$B24*(IF(G24=\"\",0,IF(H24=\"\",VLOOKUP(G24,$W$36:$X$40,2,TRUE),IF(AND((H24-$B$19)<($R37:$V37 INDIRECT(\"CBFA50\"&G24)+2),(H24-$B$19)>=($R37:$V37 INDIRECT(\"CBFA50\"&G24)-12)),VLOOKUP(G24,$W$36:$X$40,2),MAX(IF((H24-$B$19)<$R37:$V37,$R$48:$V$48,0))))))","v":0},null,null,{"$f":"$B24*(IF(J24=\"\",0,IF(K24=\"\",VLOOKUP(J24,$W$36:$X$40,2,TRUE),IF(AND((K24-$B$19)<($R37:$V37 INDIRECT(\"CBFA50\"&J24)+2),(K24-$B$19)>=($R37:$V37 INDIRECT(\"CBFA50\"&J24)-12)),VLOOKUP(J24,$W$36:$X$40,2),MAX(IF((K24-$B$19)<$R37:$V37,$R$48:$V$48,0))))))","v":0}]
[null,1,35,null,null,{"$f":"$B25*(IF(D25=\"\",0,IF(E25=\"\",VLOOKUP(D25,$W$36:$X$40,2,TRUE),IF(AND((E25-$B$19)<($R38:$V38 INDIRECT(\"CBFA50\"&D25)+2),(E25-$B$19)>=($R38:$V38 INDIRECT(\"CBFA50\"&D25)-12)),VLOOKUP(D25,$W$36:$X$40,2),MAX(IF((E25-$B$19)<$R38:$V38,$R$48:$V$48,0))))))","v":0},null,null,{"$f":"$B25*(IF(G25=\"\",0,IF(H25=\"\",VLOOKUP(G25,$W$36:$X$40,2,TRUE),IF(AND((H25-$B$19)<($R38:$V38 INDIRECT(\"CBFA50\"&G25)+2),(H25-$B$19)>=($R38:$V38 INDIRECT(\"CBFA50\"&G25)-12)),VLOOKUP(G25,$W$36:$X$40,2),MAX(IF((H25-$B$19)<$R38:$V38,$R$48:$V$48,0))))))","v":0},null,null,{"$f":"$B25*(IF(J25=\"\",0,IF(K25=\"\",VLOOKUP(J25,$W$36:$X$40,2,TRUE),IF(AND((K25-$B$19)<($R38:$V38 INDIRECT(\"CBFA50\"&J25)+2),(K25-$B$19)>=($R38:$V38 INDIRECT(\"CBFA50\"&J25)-12)),VLOOKUP(J25,$W$36:$X$40,2),MAX(IF((K25-$B$19)<$R38:$V38,$R$48:$V$48,0))))))","v":0}]
[null,1,40,null,null,{"$f":"$B26*(IF(D26=\"\",0,IF(E26=\"\",VLOOKUP(D26,$W$36:$X$40,2,TRUE),IF(AND((E26-$B$19)<($R39:$V39 INDIRECT(\"CBFA50\"&D26)+2),(E26-$B$19)>=($R39:$V39 INDIRECT(\"CBFA50\"&D26)-12)),VLOOKUP(D26,$W$36:$X$40,2),MAX(IF((E26-$B$19)<$R39:$V39,$R$48:$V$48,0))))))","v":0},null,null,{"$f":"$B26*(IF(G26=\"\",0,IF(H26=\"\",VLOOKUP(G26,$W$36:$X$40,2,TRUE),IF(AND((H26-$B$19)<($R39:$V39 INDIRECT(\"CBFA50\"&G26)+2),(H26-$B$19)>=($R39:$V39 INDIRECT(\"CBFA50\"&G26)-12)),VLOOKUP(G26,$W$36:$X$40,2),MAX(IF((H26-$B$19)<$R39:$V39,$R$48:$V$48,0))))))","v":0},null,null,{"$f":"$B26*(IF(J26=\"\",0,IF(K26=\"\",VLOOKUP(J26,$W$36:$X$40,2,TRUE),IF(AND((K26-$B$19)<($R39:$V39 INDIRECT(\"CBFA50\"&J26)+2),(K26-$B$19)>=($R39:$V39 INDIRECT(\"CBFA50\"&J26)-12)),VLOOKUP(J26,$W$36:$X$40,2),MAX(IF((K26-$B$19)<$R39:$V39,$R$48:$V$48,0))))))","v":0}]
[null,1,45,null,null,{"$f":"$B27*(IF(D27=\"\",0,IF(E27=\"\",VLOOKUP(D27,$W$36:$X$40,2,TRUE),IF(AND((E27-$B$19)<($R40:$V40 INDIRECT(\"CBFA50\"&D27)+2),(E27-$B$19)>=($R40:$V40 INDIRECT(\"CBFA50\"&D27)-12)),VLOOKUP(D27,$W$36:$X$40,2),MAX(IF((E27-$B$19)<$R40:$V40,$R$48:$V$48,0))))))","v":0},null,null,{"$f":"$B27*(IF(G27=\"\",0,IF(H27=\"\",VLOOKUP(G27,$W$36:$X$40,2,TRUE),IF(AND((H27-$B$19)<($R40:$V40 INDIRECT(\"CBFA50\"&G27)+2),(H27-$B$19)>=($R40:$V40 INDIRECT(\"CBFA50\"&G27)-12)),VLOOKUP(G27,$W$36:$X$40,2),MAX(IF((H27-$B$19)<$R40:$V40,$R$48:$V$48,0))))))","v":0},null,null,{"$f":"$B27*(IF(J27=\"\",0,IF(K27=\"\",VLOOKUP(J27,$W$36:$X$40,2,TRUE),IF(AND((K27-$B$19)<($R40:$V40 INDIRECT(\"CBFA50\"&J27)+2),(K27-$B$19)>=($R40:$V40 INDIRECT(\"CBFA50\"&J27)-12)),VLOOKUP(J27,$W$36:$X$40,2),MAX(IF((K27-$B$19)<$R40:$V40,$R$48:$V$48,0))))))","v":0}]
[null,1,50,null,null,{"$f":"$B28*(IF(D28=\"\",0,IF(E28=\"\",VLOOKUP(D28,$W$36:$X$40,2,TRUE),IF(AND((E28-$B$19)<($R41:$V41 INDIRECT(\"CBFA50\"&D28)+2),(E28-$B$19)>=($R41:$V41 INDIRECT(\"CBFA50\"&D28)-12)),VLOOKUP(D28,$W$36:$X$40,2),MAX(IF((E28-$B$19)<$R41:$V41,$R$48:$V$48,0))))))","v":0},null,null,{"$f":"$B28*(IF(G28=\"\",0,IF(H28=\"\",VLOOKUP(G28,$W$36:$X$40,2,TRUE),IF(AND((H28-$B$19)<($R41:$V41 INDIRECT(\"CBFA50\"&G28)+2),(H28-$B$19)>=($R41:$V41 INDIRECT(\"CBFA50\"&G28)-12)),VLOOKUP(G28,$W$36:$X$40,2),MAX(IF((H28-$B$19)<$R41:$V41,$R$48:$V$48,0))))))","v":0},null,null,{"$f":"$B28*(IF(J28=\"\",0,IF(K28=\"\",VLOOKUP(J28,$W$36:$X$40,2,TRUE),IF(AND((K28-$B$19)<($R41:$V41 INDIRECT(\"CBFA50\"&J28)+2),(K28-$B$19)>=($R41:$V41 INDIRECT(\"CBFA50\"&J28)-12)),VLOOKUP(J28,$W$36:$X$40,2),MAX(IF((K28-$B$19)<$R41:$V41,$R$48:$V$48,0))))))","v":0}]
[null,1,55,null,null,{"$f":"$B29*(IF(D29=\"\",0,IF(E29=\"\",VLOOKUP(D29,$W$36:$X$40,2,TRUE),IF(AND((E29-$B$19)<($R42:$V42 INDIRECT(\"CBFA50\"&D29)+2),(E29-$B$19)>=($R42:$V42 INDIRECT(\"CBFA50\"&D29)-12)),VLOOKUP(D29,$W$36:$X$40,2),MAX(IF((E29-$B$19)<$R42:$V42,$R$48:$V$48,0))))))","v":0},null,null,{"$f":"$B29*(IF(G29=\"\",0,IF(H29=\"\",VLOOKUP(G29,$W$36:$X$40,2,TRUE),IF(AND((H29-$B$19)<($R42:$V42 INDIRECT(\"CBFA50\"&G29)+2),(H29-$B$19)>=($R42:$V42 INDIRECT(\"CBFA50\"&G29)-12)),VLOOKUP(G29,$W$36:$X$40,2),MAX(IF((H29-$B$19)<$R42:$V42,$R$48:$V$48,0))))))","v":0},null,null,{"$f":"$B29*(IF(J29=\"\",0,IF(K29=\"\",VLOOKUP(J29,$W$36:$X$40,2,TRUE),IF(AND((K29-$B$19)<($R42:$V42 INDIRECT(\"CBFA50\"&J29)+2),(K29-$B$19)>=($R42:$V42 INDIRECT(\"CBFA50\"&J29)-12)),VLOOKUP(J29,$W$36:$X$40,2),MAX(IF((K29-$B$19)<$R42:$V42,$R$48:$V$48,0))))))","v":0}]
[null,1,60,null,null,{"$f":"$B30*(IF(D30=\"\",0,IF(E30=\"\",VLOOKUP(D30,$W$36:$X$40,2,TRUE),IF(AND((E30-$B$19)<($R43:$V43 INDIRECT(\"CBFA50\"&D30)+2),(E30-$B$19)>=($R43:$V43 INDIRECT(\"CBFA50\"&D30)-12)),VLOOKUP(D30,$W$36:$X$40,2),MAX(IF((E30-$B$19)<$R43:$V43,$R$48:$V$48,0))))))","v":0},null,null,{"$f":"$B30*(IF(G30=\"\",0,IF(H30=\"\",VLOOKUP(G30,$W$36:$X$40,2,TRUE),IF(AND((H30-$B$19)<($R43:$V43 INDIRECT(\"CBFA50\"&G30)+2),(H30-$B$19)>=($R43:$V43 INDIRECT(\"CBFA50\"&G30)-12)),VLOOKUP(G30,$W$36:$X$40,2),MAX(IF((H30-$B$19)<$R43:$V43,$R$48:$V$48,0))))))","v":0},null,null,{"$f":"$B30*(IF(J30=\"\",0,IF(K30=\"\",VLOOKUP(J30,$W$36:$X$40,2,TRUE),IF(AND((K30-$B$19)<($R43:$V43 INDIRECT(\"CBFA50\"&J30)+2),(K30-$B$19)>=($R43:$V43 INDIRECT(\"CBFA50\"&J30)-12)),VLOOKUP(J30,$W$36:$X$40,2),MAX(IF((K30-$B$19)<$R43:$V43,$R$48:$V$48,0))))))","v":0}]
[null,"RESULT",null,{"$f":"SUM(F20:F30)","v":0},null,null,{"$f":"SUM(I20:I30)","v":0},null,null,{"$f":"SUM(L20:L30)","v":0}]
[null,null,null,null,null,null,null,null,null,null,null,null,null,null,null,null,null,"Green","Yellow","Orange","Brown","Red"]
[null,"LONGITUDINAL",null,"DAYTIME",null,null,null,null,null,null,null,null,null,null,null,null,10,0,null,null,null,10]
[null,null,null,"CBLA-50",null,null,"CBLA-25",null,null,null,null,null,null,null,null,null,15,0,null,null,10,15]
[null,15,"<--Target speed for relative impact speed judgement","OEM","Vimpact","Points","TTCFCW",null,"Points",null,null,null,null,null,null,null,20,0,null,null,10,{"$f":"Q35","v":20}]
[null,1,25,null,null,{"$f":"$B36*(IF(D36=\"\",0,IF(E36=\"\",VLOOKUP(D36,$W$36:$X$40,2,TRUE),IF(AND((E36-$B$35)<($R36:$V36 INDIRECT(\"CBFA50\"&D36)+2),(E36-$B$35)>=($R36:$V36 INDIRECT(\"CBFA50\"&D36)-12)),VLOOKUP(D36,$W$36:$X$40,2),MAX(IF((E36-$B$35)<$R36:$V36,$R$48:$V$48,0))))))","v":0},null,null,null,null,null,null,null,null,null,null,25,0,null,10,20,{"$f":"Q36","v":25},"Brown",0.25]
[null,1,30,null,null,{"$f":"$B37*(IF(D37=\"\",0,IF(E37=\"\",VLOOKUP(D37,$W$36:$X$40,2,TRUE),IF(AND((E37-$B$35)<($R37:$V37 INDIRECT(\"CBFA50\"&D37)+2),(E37-$B$35)>=($R37:$V37 INDIRECT(\"CBFA50\"&D37)-12)),VLOOKUP(D37,$W$36:$X$40,2),MAX(IF((E37-$B$35)<$R37:$V37,$R$48:$V$48,0))))))","v":0},null,null,null,null,null,null,null,null,null,null,30,0,null,10,20,30,"Green",1]
[null,2,35,null,null,{"$f":"$B38*(IF(D38=\"\",0,IF(E38=\"\",VLOOKUP(D38,$W$36:$X$40,2,TRUE),IF(AND((E38-$B$35)<($R38:$V38 INDIRECT(\"CBFA50\"&D38)+2),(E38-$B$35)>=($R38:$V38 INDIRECT(\"CBFA50\"&D38)-12)),VLOOKUP(D38,$W$36:$X$40,2),MAX(IF((E38-$B$35)<$R38:$V38,$R$48:$V$48,0))))))","v":0},null,null,null,null,null,null,null,null,null,null,35,0,10,20,30,35,"Orange",0.5]
[null,2,40,null,null,{"$f":"$B39*(IF(D39=\"\",0,IF(E39=\"\",VLOOKUP(D39,$W$36:$X$40,2,TRUE),IF(AND((E39-$B$35)<($R39:$V39 INDIRECT(\"CBFA50\"&D39)+2),(E39-$B$35)>=($R39:$V39 INDIRECT(\"CBFA50\"&D39)-12)),VLOOKUP(D39,$W$36:$X$40,2),MAX(IF((E39-$B$35)<$R39:$V39,$R$48:$V$48,0))))))","v":0},null,null,null,null,null,null,null,null,null,null,40,0,10,20,30,40,"Red",0]
[null,3,45,null,null,{"$f":"$B40*(IF(D40=\"\",0,IF(E40=\"\",VLOOKUP(D40,$W$36:$X$40,2,TRUE),IF(AND((E40-$B$35)<($R40:$V40 INDIRECT(\"CBFA50\"&D40)+2),(E40-$B$35)>=($R40:$V40 INDIRECT(\"CBFA50\"&D40)-12)),VLOOKUP(D40,$W$36:$X$40,2),MAX(IF((E40-$B$35)<$R40:$V40,$R$48:$V$48,0))))))","v":0},null,null,null,null,null,null,null,null,null,null,45,0,10,20,30,45,"Yellow",0.75]
[null,3,50,null,null,{"$f":"$B41*(IF(D41=\"\",0,IF(E41=\"\",VLOOKUP(D41,$W$36:$X$40,2,TRUE),IF(AND((E41-$B$35)<($R41:$V41 INDIRECT(\"CBFA50\"&D41)+2),(E41-$B$35)>=($R41:$V41 INDIRECT(\"CBFA50\"&D41)-12)),VLOOKUP(D41,$W$36:$X$40,2),MAX(IF((E41-$B$35)<$R41:$V41,$R$48:$V$48,0))))))","v":0},null,null,{"$f":"IF(G41=\"\",0,IF(G41>=1.7,$B41,0))","v":0},null,null,null,null,null,null,null,50,0,10,20,30,50]
[null,3,55,null,null,{"$f":"$B42*(IF(D42=\"\",0,IF(E42=\"\",VLOOKUP(D42,$W$36:$X$40,2,TRUE),IF(AND((E42-$B$35)<($R42:$V42 INDIRECT(\"CBFA50\"&D42)+2),(E42-$B$35)>=($R42:$V42 INDIRECT(\"CBFA50\"&D42)-12)),VLOOKUP(D42,$W$36:$X$40,2),MAX(IF((E42-$B$35)<$R42:$V42,$R$48:$V$48,0))))))","v":0},null,null,{"$f":"IF(G42=\"\",0,IF(G42>=1.7,$B42,0))","v":0},null,null,null,null,null,null,null,55,0,10,20,30,55]
[null,1,60,null,null,{"$f":"$B43*(IF(D43=\"\",0,IF(E43=\"\",VLOOKUP(D43,$W$36:$X$40,2,TRUE),IF(AND((E43-$B$35)<($R43:$V43 INDIRECT(\"CBFA50\"&D43)+2),(E43-$B$35)>=($R43:$V43 INDIRECT(\"CBFA50\"&D43)-12)),VLOOKUP(D43,$W$36:$X$40,2),MAX(IF((E43-$B$35)<$R43:$V43,$R$48:$V$48,0))))))","v":0},null,null,0,null,null,null,null,null,null,null,60,0,10,20,30,60]
[null,1,65,null,null,null,null,null,0,null,null,null,null,null,null,null,65]
[null,1,70,null,null,null,null,null,0,null,null,null,null,null,null,null,70]
[null,1,75,null,null,null,null,null,0,null,null,null,null,null,null,null,75]
[null,1,80,null,null,null,null,null,0,null,null,null,null,null,null,null,80]
[null,"RESULT",null,{"$f":"SUM(F36:F43)","v":0},null,null,{"$f":"SUM(I41:I47)","v":0},null,null,null,null,null,null,null,null,null,null,1,0.75,0.5,0.25,0]
[]
[null,"TURNING",null,"DAYTIME"]
[null,null,null,"CBTA-50 farside opposite",null,null,"CBTA-50 nearside opposite"]
[null,null,null,"Vimpact",null,"Points","Vimpact",null,"Points"]
[null,1,10,null,null,{"$f":"IF(D53=\"\",0,IF(D53=0,1,0))","v":0},null,null,{"$f":"IF(G53=\"\",0,IF(G53=0,1,0))","v":0}]
[null,1,15,null,null,{"$f":"IF(D54=\"\",0,IF(D54=0,1,0))","v":0}]
[null,1,20,null,null,{"$f":"IF(D55=\"\",0,IF(D55=0,1,0))","v":0}]
[null,"RESULT",null,{"$f":"SUM(F53:F55,I53)","v":0}]
[]
[null,"DOORING",null,"DAYTIME"]
[null,"Door type","Conventional","Driver door",null,null,"All side doors"]
[null,0.25,null,"TTCSTART","TTCEND","Points "]
[null,0.25,"Information",null,null,{"$f":"IF(D61=\"\",0,IF(D61>=2.3,B61,0))","v":0}]
[null,0.25,"Warning",null,null,{"$f":"_xlfn.SWITCH(C59,\"Conventional\",IF(D62=\"\",0,IF(AND(D62>=1.7,F61>0),B62,0)),\"Sliding\",IF(D62=\"\",0,IF(AND(D62>=1.7,F61>0),B62+B60,0)))","v":0},"Result",null,null,null,null,null,null,null,null,null,null,99999]
[null,{"$f":"IF(F62=0,0.5,0.25)","v":0.5},"Retention",null,null,{"$f":"IF(D63=\"\",0,IF(AND(D63>=1.7,E63<=-0.4,E63<>\"\"),B63,0))","v":0},null,null,null,null,null,null,null,null,null,null,null,99999]
[null,"RESULT",null,{"$f":"IF(AND(I62=\"Pass\",F62=0,F63=0,F61>0),F61,IF(I62=\"Pass\",F63+F62+F61+B62,F63+F62+F61))","v":0}]
[]
[null,"SUMMARY",null,"DAYTIME"]
[null,null,null,null,null,null,"Points"]
[null,null,"CBFA-50",{"$f":"ROUND(D31/11,2)","v":0},null,null,{"$f":"D68*2","v":0}]
[null,null,"CBNA-50",{"$f":"ROUND(G31/11,2)","v":0},null,null,{"$f":"D69*1","v":0}]
[null,null,"CBNAO-50",{"$f":"ROUND(J31/11,2)","v":0},null,null,{"$f":"D70*1","v":0}]
[null,null,"CBLA",{"$f":"ROUND((D48+G48)/27,2)","v":0},null,null,{"$f":"D71*2","v":0}]
[null,null,"CBTA",{"$f":"ROUND((D56+J56)/4,2)","v":0},null,null,{"$f":"D72*2","v":0}]
[null,null,"CBDA",{"$f":"ROUND(D64,2)","v":0},null,null,{"$f":"D73*1","v":0}]
[null,"TOTAL",null,{"$f":"SUM(G68:I73)","v":0}]
[]
[null,"TOTAL AEB Bicyclist",null,{"$f":"IF(NOT(D15=\"PASS\"),0,SUM(D74:O74))","v":0}]

{"sheet":"VRU AEB Motorcyclist","index":18,"n_rows":71,"n_cols":21,"rows_kept":71,"cut":false,"hidden":false,"merged":[[22,6,22,8],[23,6,23,8],[40,6,40,8],[38,3,38,4],[38,9,38,10],[20,12,20,14],[21,12,21,14],[22,12,22,14],[23,12,23,14],[37,3,37,4],[37,6,37,7],[37,9,37,10],[29,12,29,14],[29,9,29,11],[39,3,39,4],[39,9,39,10],[40,3,40,5],[30,9,30,11],[34,3,34,11],[25,12,25,14],[18,3,18,5],[18,6,18,8],[35,3,35,5],[35,6,35,8],[16,3,16,20],[17,9,17,14],[17,15,17,20],[26,12,26,14],[27,12,27,14],[20,9,20,11],[21,9,21,11],[22,9,22,11],[23,9,23,11],[24,9,24,11],[18,15,18,17],[18,18,18,20],[20,15,20,17],[20,18,20,20],[21,15,21,17],[25,9,25,11],[18,9,18,11],[18,12,18,14],[21,18,21,20],[22,15,22,17],[22,18,22,20],[17,3,17,8],[20,6,20,8],[21,6,21,8],[51,13,51,14],[51,9,51,10],[47,9,47,10],[48,9,48,10],[58,6,58,8],[30,15,30,17],[36,6,36,7],[36,9,36,10],[30,12,30,14],[46,7,46,8],[47,7,47,8],[48,7,48,8],[49,7,49,8],[50,7,50,8],[47,13,47,14],[48,13,48,14],[49,13,49,14],[50,13,50,14],[33,3,33,11],[40,9,40,11],[45,13,45,14],[44,11,44,14],[46,9,46,10],[46,13,46,14],[36,3,36,4],[35,9,35,11],[38,6,38,7],[46,11,46,12],[47,11,47,12],[57,3,57,5],[29,18,29,20],[23,15,23,17],[23,18,23,20],[24,15,24,17],[24,18,24,20],[25,15,25,17],[25,18,25,20],[26,15,26,17],[26,18,26,20],[27,15,27,17],[27,18,27,20],[29,15,29,17],[30,18,30,20],[31,15,31,17],[31,18,31,20],[39,6,39,7],[52,3,52,6],[44,7,44,10],[45,7,45,8],[45,9,45,10],[45,11,45,12],[43,3,43,6],[43,7,43,14],[70,1,70,2],[70,3,70,14],[68,1,68,2],[68,3,68,8],[58,3,58,5],[66,6,66,8],[67,3,67,5],[67,6,67,8],[66,3,66,5],[64,3,64,5],[64,6,64,8],[62,3,62,8],[60,3,60,5],[60,6,60,8],[61,3,61,5],[61,6,61,8],[59,3,59,8],[63,3,63,5],[63,6,63,8],[65,3,65,5],[65,6,65,8],[57,6,57,8],[55,3,55,5],[55,6,55,8],[56,3,56,8],[1,1,2,2],[1,3,3,14],[3,1,3,2],[4,3,4,14],[5,3,5,14],[6,3,6,14],[14,1,14,2],[7,3,7,14],[8,3,8,14],[14,3,14,14],[13,3,13,14],[12,3,12,14],[11,3,11,14],[10,3,10,14],[47,3,47,6],[24,12,24,14],[54,1,54,2],[54,3,54,8],[52,7,52,10],[51,11,51,12],[51,7,51,8],[52,11,52,14],[40,1,40,2],[52,1,52,2],[51,3,51,6],[49,3,49,6],[26,9,26,11],[27,9,27,11],[31,1,31,2],[31,3,31,5],[31,6,31,8],[31,9,31,11],[31,12,31,14],[49,11,49,12],[50,11,50,12],[48,3,48,6],[48,11,48,12],[50,3,50,6],[49,9,49,10],[50,9,50,10],[44,3,44,6],[45,3,45,6],[46,3,46,6],[42,3,42,14]]}
[3]
[null,"AEB Motorcyclist"]
[]
[null,{"$f":"'General Overview'!G13","v":""}]
[null,"SYSTEM DETAILS"]
[null,null,"System Name"]
[null,null,"Functionality"]
[null,null,"Speed range (km/h) - Minimum"]
[null,null,"Maximum"]
[]
[null,"PREREQUISITES"]
[]
[null,null,"Default ON"]
[null,null,"System switches off below 80 km/h"]
[null,"PREREQUISITES",null,{"$f":"IF(AND(D13=\"YES\",D14=\"NO\",SUM('OVERALL RATING'!H7:H10)>18),\"PASS\",\"FAIL\")","v":"FAIL"}]
[]
[null,"LONGITUDINAL",null,"DAYTIME"]
[null,null,null,"CMRs-50",null,null,null,null,null,"CMRb-25-12m",null,null,null,null,null,"CMRb-25-40m"]
[null,null,null,"AEB",null,null,"FCW",null,null,"AEB",null,null,"FCW",null,null,"AEB",null,null,"FCW"]
[null,null,null,"OEM","Vimpact","Points","OEM","Vimpact","Points","OEM","Vimpact","Points","OEM","Vimpact","Points","OEM","Vimpact","Points","OEM","Vimpact","Points"]
[null,1,10,null,null,{"$f":"IF(D21=\"\",0,IF(E21=\"\",IF(D21=\"Green\",$B21,IF(D21=\"Yellow\",0.75*$B21,IF(D21=\"Orange\",0.5*$B21,IF(D21=\"Brown\",0.25*$B21,0)))),IF(E21<2,$B21,0)))","v":0}]
[null,1,15,null,null,{"$f":"IF(D22=\"\",0,IF(E22=\"\",IF(D22=\"Green\",$B22,IF(D22=\"Yellow\",0.75*$B22,IF(D22=\"Orange\",0.5*$B22,IF(D22=\"Brown\",0.25*$B22,0)))),IF(E22<2,$B22,IF(E22<12,0.25*$B22,0))))","v":0}]
[null,1,20,null,null,{"$f":"IF(D23=\"\",0,IF(E23=\"\",IF(D23=\"Green\",$B23,IF(D23=\"Yellow\",0.75*$B23,IF(D23=\"Orange\",0.5*$B23,IF(D23=\"Brown\",0.25*$B23,0)))),IF(E23<2,$B23,IF(E23<12,0.25*$B23,0))))","v":0}]
[null,1,25,null,null,{"$f":"IF(D24=\"\",0,IF(E24=\"\",IF(D24=\"Green\",$B24,IF(D24=\"Yellow\",0.75*$B24,IF(D24=\"Orange\",0.5*$B24,IF(D24=\"Brown\",0.25*$B24,0)))),IF(E24<2,$B24,IF(E24<12,0.5*$B24,IF(E24<22,0.25*$B24,0)))))","v":0}]
[null,1,30,null,null,{"$f":"IF(D25=\"\",0,IF(E25=\"\",IF(D25=\"Green\",$B25,IF(D25=\"Yellow\",0.75*$B25,IF(D25=\"Orange\",0.5*$B25,IF(D25=\"Brown\",0.25*$B25,0)))),IF(E25<2,$B25,IF(E25<12,0.5*$B25,IF(E25<22,0.25*$B25,0)))))","v":0},null,null,{"$f":"IF(G25=\"\",0,IF(H25=\"\",IF(G25=\"Green\",$B25,IF(G25=\"Yellow\",0.75*$B25,IF(G25=\"Orange\",0.5*$B25,IF(G25=\"Brown\",0.25*$B25,0)))),IF(H25<2,$B25,IF(H25<12,0.5*$B25,IF(H25<22,0.25*$B25,0)))))","v":0}]
[null,1,35,null,null,{"$f":"IF(D26=\"\",0,IF(E26=\"\",IF(D26=\"Green\",$B26,IF(D26=\"Yellow\",0.75*$B26,IF(D26=\"Orange\",0.5*$B26,IF(D26=\"Brown\",0.25*$B26,0)))),IF(E26<2,$B26,IF(E26<12,0.75*$B26,IF(E26<22,0.5*$B26,IF(E26<32,0.25*$B26,0))))))","v":0},null,null,{"$f":"IF(G26=\"\",0,IF(H26=\"\",IF(G26=\"Green\",$B26,IF(G26=\"Yellow\",0.75*$B26,IF(G26=\"Orange\",0.5*$B26,IF(G26=\"Brown\",0.25*$B26,0)))),IF(H26<2,$B26,IF(H26<12,0.75*$B26,IF(H26<22,0.5*$B26,IF(H26<32,0.25*$B26,0))))))","v":0}]
[null,1,40,null,null,0,null,null,0]
[null,1,45,null,null,0,null,null,0]
[null,1,50,null,null,0,null,null,0,null,null,{"$f":"IF(J29=\"\",0,IF(K29=\"\",IF(J29=\"Green\",$B29,IF(J29=\"Yellow\",0.75*$B29,IF(J29=\"Orange\",0.5*$B29,IF(J29=\"Brown\",0.25*$B29,0)))),IF(K29<2,$B29,IF(K29<12,0.75*$B29,IF(K29<22,0.5*$B29,IF(K29<32,0.25*$B29,0))))))","v":0},null,null,{"$f":"IF(M29=\"\",0,IF(N29=\"\",IF(M29=\"Green\",$B29,IF(M29=\"Yellow\",0.75*$B29,IF(M29=\"Orange\",0.5*$B29,IF(M29=\"Brown\",0.25*$B29,0)))),IF(N29<2,$B29,IF(N29<12,0.75*$B29,IF(N29<22,0.5*$B29,IF(N29<32,0.25*$B29,0))))))","v":0},null,null,{"$f":"IF(P29=\"\",0,IF(Q29=\"\",IF(P29=\"Green\",$B29,IF(P29=\"Yellow\",0.75*$B29,IF(P29=\"Orange\",0.5*$B29,IF(P29=\"Brown\",0.25*$B29,0)))),IF(Q29<2,$B29,IF(Q29<12,0.75*$B29,IF(Q29<22,0.5*$B29,IF(Q29<32,0.25*$B29,0))))))","v":0},null,null,{"$f":"IF(S29=\"\",0,IF(T29=\"\",IF(S29=\"Green\",$B29,IF(S29=\"Yellow\",0.75*$B29,IF(S29=\"Orange\",0.5*$B29,IF(S29=\"Brown\",0.25*$B29,0)))),IF(T29<2,$B29,IF(T29<12,0.75*$B29,IF(T29<22,0.5*$B29,IF(T29<32,0.25*$B29,0))))))","v":0}]
[null,1,55,null,null,0,null,null,0]
[null,1,60,null,null,0,null,null,0]
[null,"RESULT",null,{"$f":"SUM(F21:F31)","v":0},null,null,{"$f":"SUM(I25:I31)","v":0},null,null,{"$f":"SUM(L21:L30)","v":0},null,null,{"$f":"SUM(O21:O30)","v":0},null,null,{"$f":"SUM(R21:R30)","v":0},null,null,{"$f":"SUM(U21:U30)","v":0}]
[]
[null,"TURNING",null,"DAYTIME"]
[null,null,null,"CMFtap"]
[null,null,null,"30 km/h",null,null,"45 km/h",null,null,"60 km/h"]
[null,null,null,"Vimpact",null,"Points","Vimpact",null,"Points","Vimpact",null,"Points"]
[null,1,10,null,null,{"$f":"IF(D38=\"\",0,IF(D38=0,1,0))","v":0},null,null,{"$f":"IF(G38=\"\",0,IF(G38=0,1,0))","v":0},null,null,{"$f":"IF(J38=\"\",0,IF(J38=0,1,0))","v":0}]
[null,1,15,null,null,{"$f":"IF(D39=\"\",0,IF(D39=0,1,0))","v":0},null,null,{"$f":"IF(G39=\"\",0,IF(G39=0,1,0))","v":0},null,null,{"$f":"IF(J39=\"\",0,IF(J39=0,1,0))","v":0}]
[null,1,20,null,null,{"$f":"IF(D40=\"\",0,IF(D40=0,1,0))","v":0},null,null,{"$f":"IF(G40=\"\",0,IF(G40=0,1,0))","v":0},null,null,{"$f":"IF(J40=\"\",0,IF(J40=0,1,0))","v":0}]
[null,"RESULT",null,{"$f":"SUM(F38:F40)","v":0},null,null,{"$f":"SUM(I38:I40)","v":0},null,null,{"$f":"SUM(L38:L40)","v":0}]
[]
[null,"LATERAL",null,"DAYTIME"]
[null,null,null,"CMoncoming",null,null,null,"CMovertaking"]
[null,null,null,"VUT & EMT @ 72 km/h",null,null,null,"VUT @ 50 & EMT @ 60 km/h",null,null,null,"VUT @ 72 & EMT @ 80 km/h"]
[null,null,null,"Unintentional",null,null,null,"Unintentional",null,"Intentional",null,"Unintentional",null,"Intentional"]
[null,1,0.2]
[null,1,0.3]
[null,2,0.4]
[null,2,0.5]
[null,3,0.6]
[null,3,0.7]
[null,"RESULT",null,{"$f":"IF(COUNTIF(D47:E51,\"Pass\")=5,2,0)","v":0},null,{"$f":"IF(COUNTIF(F47:G51,\"Pass\")=5,0.5,0)","v":0},null,{"$f":"IF(COUNTIF(H47:K52,\"Pass\")=8,1,0)","v":0},null,{"$f":"IF(COUNTIF(J47:K51,\"Pass\")=5,0.5,0)","v":0},null,{"$f":"IF(COUNTIF(L47:O52,\"Pass\")=8,1,0)","v":0},null,{"$f":"IF(COUNTIF(N47:O51,\"Pass\")=5,0.5,0)","v":0},null,null,"AP 20231107: Merged scores from Unintentional and Intentional load cases"]
[]
[null,"SUMMARY",null,"DAYTIME"]
[null,null,null,null,null,null,"Points"]
[null,null,"CMRs-50 "]
[null,null,"AEB",{"$f":"ROUND(D32/11,2)","v":0},null,null,{"$f":"D58*1","v":0}]
[null,null,"FCW",{"$f":"ROUND(G32/7,2)","v":0},null,null,{"$f":"D59*0.5","v":0}]
[null,null,"CMRb-25-12m "]
[null,null,"AEB",{"$f":"ROUND(J32/1,2)","v":0},null,null,{"$f":"D61*0.5","v":0}]
[null,null,"FCW",{"$f":"ROUND(M32/1,2)","v":0},null,null,{"$f":"D62*0.25","v":0}]
[null,null,"CMRb-25-40m "]
[null,null,"AEB",{"$f":"ROUND(P32/1,2)","v":0},null,null,{"$f":"D64*0.5","v":0}]
[null,null,"FCW",{"$f":"ROUND(S32/1,2)","v":0},null,null,{"$f":"D65*0.25","v":0}]
[null,null,"CMFtap",{"$f":"ROUND(SUM(D41:L41)/9,2)","v":0},null,null,{"$f":"D66*3","v":0}]
[null,null,"CMoncoming",{"$f":"ROUND(D53/2,2)","v":0},null,null,{"$f":"D67*2","v":0}]
[null,null,"CMovertaking",{"$f":"ROUND(SUM(H53:O53)/2,2)","v":0},null,null,{"$f":"D68*1","v":0}]
[null,"TOTAL",null,{"$f":"SUM(G57:I68)","v":0}]
[]
[null,"TOTAL AEB Motorcyclist",null,{"$f":"IF(NOT(D15=\"PASS\"),0,SUM(D69:O69))","v":0}]

{"sheet":"SA OSM","index":19,"n_rows":52,"n_cols":19,"rows_kept":52,"cut":false,"hidden":false,"merged":[[35,8,36,8],[38,1,40,1],[38,2,38,5],[39,2,39,5],[40,2,40,5],[25,1,37,1],[25,2,29,2],[30,2,34,2],[35,2,37,2],[25,3,27,4],[28,3,29,4],[32,3,33,4],[35,3,36,4],[37,3,37,4],[34,3,34,4],[35,5,36,5],[42,1,42,2],[42,3,42,7],[35,6,36,6],[35,7,36,7],[41,1,41,6],[50,1,50,2],[8,1,8,2],[46,1,46,2],[44,1,44,2],[10,5,10,8],[44,3,44,8],[14,3,14,4],[16,3,16,4],[8,3,8,6],[11,3,11,4],[12,3,12,4],[13,3,13,4],[17,1,17,2],[17,3,17,8],[15,3,15,4],[22,1,22,2],[50,3,50,8],[3,3,3,4],[8,7,8,8],[5,7,7,7],[5,3,5,4],[10,3,10,4],[46,3,46,8],[47,3,47,8],[48,3,48,8],[21,3,21,4],[24,3,24,4],[22,3,22,8],[18,3,18,4],[19,3,19,4],[20,3,20,4],[30,3,31,4],[5,5,7,5],[4,5,4,8],[1,1,2,2],[1,3,2,4],[3,1,3,2],[4,3,4,4],[1,7,2,8],[1,5,2,6],[6,3,6,4],[7,3,7,4]]}
[null,null,null,null,null,null,null,null,null,null,null,null,null,null,null,null,null,"Fail",0]
[null,"Occupant Status Monitoring",null,"Driver",null,"Front Passenger(s)",null,"Rear Passengers",null,null,null,null,null,null,null,null,null,"1 Pass",0.03]
[null,null,null,null,null,null,null,null,null,null,null,null,null,null,null,null,null,"2 Pass"]
[null,{"$f":"'General Overview'!G14","v":""},null,"Score",null,"Nr of seats","Score","Nr of seats","Score",null,null,null,null,null,null,null,null,"3 Pass"]
[null,"SEAT BELT REMINDER",null,null,null,"Including ALL optional seats",null,null,null,null,null,null,null,null,null,null,null,"4 Pass"]
[null,null,"Occupant detection",null,null,{"$f":"'General Overview'!C16-1","v":-1},null,{"$f":"SUM('General Overview'!C17:D18)","v":0},null,null,null,null,null,null,null,null,null,"5 Pass"]
[null,{"$f":"IF(I7=\"Fail\",\"Fail\",IF(VALUE(LEFT(I7,1))<H6,\"Fail\",\"Pass\"))","v":{"$error":"#VALUE!"}},"Visual warning",null,null,null,null,null,null,null,null,null,null,null,null,null,null,"6 Pass"]
[null,{"$f":"IF(I8=\"Fail\",\"Fail\",IF(VALUE(LEFT(I8,1))<H6,\"Fail\",\"Pass\"))","v":{"$error":"#VALUE!"}},"Audible warning"]
[null,"Seat Belt Reminder assessment",null,{"$f":"IF(AND(D7=\"Pass\",D8=\"Pass\",LEFT(G6,1)=TEXT(F6,0),LEFT(G7,1)=TEXT(F6,0),LEFT(G8,1)=TEXT(F6,0)),\"Pass\",\"Fail\")","v":"Fail"},null,null,null,{"$f":"IF(OR(D9=\"Fail\",I6=\"Fail\"),0,IF(AND(B7:B8=\"Pass\"),VALUE(LEFT(I6,1)/H6),0))","v":0}]
[]
[null,"DRIVER MONITORING"]
[null,null,"Default ON"]
[null,null,"Deactivation"]
[null,null,"System type - Direct or indirect monitoring",null,null,null,{"$f":"IF(VALUE(LEFT(G6,1))=$F$6,\"Pass\",\"Fail\")","v":{"$error":"#VALUE!"}}]
[null,null,"Active speed",null,null,null,{"$f":"IF(VALUE(LEFT(G7,1))=$F$6,\"Pass\",\"Fail\")","v":{"$error":"#VALUE!"}},null,{"$f":"IF(VALUE(LEFT(I7,1))=$H$6,\"Pass\",\"Fail\")","v":{"$error":"#VALUE!"}}]
[null,null,null,null,null,null,{"$error":"#VALUE!"},null,{"$error":"#VALUE!"}]
[null,null,"Attention Assist dossier",null,null,null,{"$f":"IF(VALUE(LEFT(G8,1))=$F$6,\"Pass\",\"Fail\")","v":{"$error":"#VALUE!"}},null,{"$f":"IF(VALUE(LEFT(I8,1))=$H$6,\"Pass\",\"Fail\")","v":{"$error":"#VALUE!"}}]
[null,"Eligibility for scoring",null,{"$f":"IF(AND(NOT(AND(D14=\"Direct\",D15=\">65km/h\")),SUM('OVERALL RATING'!H7:H10)>18,COUNTIFS(D12:D17,\"Pass\")=3,NOT(OR('SA AEB Car-to-Car'!D15=\"FAIL\",'VRU AEB Motorcyclist'!D15=\"FAIL\",'VRU AEB Bicyclist'!D15=\"FAIL\",'VRU AEB Pedestrian'!D16=\"FAIL\")),G14=\"Pass\",G15=\"Pass\",G17=\"Pass\",I15=\"Pass\",I17=\"Pass\"),\"Pass\",\"Fail\")","v":{"$error":"#VALUE!"}}]
[]
[null,null,"Noise variables - Drivers"]
[null,null,"Noise variables - Occlusion"]
[null,null,"Noise variables - Driver behaviours"]
[null,"Noise variables",null,{"$f":"IF(COUNTIFS(D20:D22,\"Pass\")=3,\"Yes\",\"No\")","v":"No"}]
[]
[null,null,"Inattention Type","Scenario",null,"Movement","Warning","Intervention","Sub-totals"]
[null,"Distraction","Long Distraction","Away from forward road, non-driving task",null,"Owl ",null,null,{"$f":"IF(G26=\"Yes\",R26,0)+IF(H26=\"Yes\",S26,0)","v":0},null,null,null,null,null,null,null,null,0.03,0.03]
[null,null,null,null,null,"Lizard",null,null,0,null,null,null,null,null,null,null,null,0.03,0.03]
[null,null,null,null,null,"Body lean",null,null,0,null,null,null,null,null,null,null,null,0.03,0.03]
[null,null,null,"Driving task",null,"Owl ",null,null,0,null,null,null,null,null,null,null,null,0.03,0.03]
[null,null,null,null,null,"Lizard",null,null,0,null,null,null,null,null,null,null,null,0.03,0.03]
[null,null,"Short Distraction (VATS)","Away from forward road, non-driving task",null,"Owl ",null,null,0,null,null,null,null,null,null,null,null,0.03,0.03]
[null,null,null,null,null,"Lizard",null,null,0,null,null,null,null,null,null,null,null,0.03,0.03]
[null,null,null,"Driving task",null,"Owl ",null,null,0,null,null,null,null,null,null,null,null,0.03,0.03]
[null,null,null,null,null,"Lizard",null,null,0,null,null,null,null,null,null,null,null,0.03,0.03]
[null,null,null,"Away from road (multiple locations)",null,"Lizard",null,null,0,null,null,null,null,null,null,null,null,0.03,0.03]
[null,null,"Phone Usage","Phone Use Detection – Basic ",null,"Owl +\nLizard",null,null,0,null,null,null,null,null,null,null,null,0.05,0.1]
[]
[null,null,null,"Phone Use Detection – Advanced ",null,"Lizard",null,null,{"$f":"IF(G38=\"Yes\",R38,0)+IF(H38=\"Yes\",S38,0)","v":0},null,null,null,null,null,null,null,null,0.05,0.1]
[null,"Fatigue","Drowsiness",null,null,null,null,null,{"$f":"IF(G39=\"Yes\",R39,0)+IF(H39=\"Yes\",S39,0)","v":0},null,null,null,null,null,null,null,null,0.25,0.1]
[null,null,"Microsleep",null,null,null,null,null,{"$f":"IF(G40=\"Yes\",R40,0)+IF(H40=\"Yes\",S40,0)","v":0},null,null,null,null,null,null,null,null,0.2,0.1]
[null,null,"Sleep",null,null,null,null,null,{"$f":"IF(G41=\"Yes\",R41,0)+IF(H41=\"Yes\",S41,0)","v":0},null,null,null,null,null,null,null,null,0.05,0.2]
[null,"Unresponsive Driver - Sudden Sickness",null,null,null,null,null,null,{"$f":"IF(G42=\"Yes\",R42,0)+IF(H42=\"Yes\",S42,0)","v":0},null,null,null,null,null,null,null,null,null,0.2]
[null,"Total Scenario Score",null,null,null,null,null,null,{"$f":"SUM(I26:I42)","v":0}]
[]
[null,"Driver Monitoring assessment",null,{"$f":"IF(AND('General Overview'!E65=\"Standard\",D18=\"Pass\",D23=\"Yes\"),I43,0)","v":{"$error":"#VALUE!"}}]
[]
[null,"SUMMARY"]
[null,null,"Seat Belt Reminder assessment",{"$f":"IF(D9=\"FAIL\",0,IF(H6=0,IF(D9=\"PASS\",2,0),SUM(H9)))","v":0}]
[null,null,"Driver Monitoring assessment",{"$f":"D45","v":{"$error":"#VALUE!"}}]
[]
[null,"TOTAL OCCUPANT STATUS MONITORING",null,{"$f":"IF(OR(ISERROR(D48:I49)=TRUE),0,D48+D49)","v":0}]
[null,null,null,{"$f":"IF(AND(D9=2,H9>0),\"All seats\",IF(D9=2,\"Front seats\",\"Not available\"))","v":"Not available"}]

{"sheet":"SA SAS","index":20,"n_rows":72,"n_cols":7,"rows_kept":72,"cut":false,"hidden":false,"merged":[[51,1,51,2],[51,3,51,5],[1,1,2,2],[1,3,2,5],[3,1,3,2],[4,3,4,5],[5,3,5,5],[14,3,14,5],[8,3,8,4],[11,3,11,4],[12,3,12,4],[13,3,13,4],[9,3,9,4],[71,1,71,2],[71,3,71,5],[65,1,65,2],[65,3,65,5],[68,3,68,5],[67,1,67,2],[67,3,67,5],[53,3,53,5],[54,3,54,5],[69,3,69,5],[56,3,56,5],[55,3,55,5],[57,3,57,4],[58,3,58,4],[60,3,60,4],[61,3,61,4],[63,3,63,4],[64,3,64,4]]}
[]
[null,"Speed Assist System"]
[]
[null,{"$f":"'General Overview'!G15","v":""},null,"Value",null,"Score"]
[null,"SYSTEM DETAILS"]
[null,null,"System name",null,null,null,{"$f":"D6","v":0}]
[]
[null,"SPEED LIMIT INFORMATION FUNCTION",null,null,null,"Score"]
[null,null,"Type of system"]
[null,null,"General requirements - GSR compliant",null,null,{"$f":"D10","v":0}]
[null,null,"Warning function"]
[null,null,"Default ON at start of every journey",null,null,{"$f":"D12","v":0}]
[null,null,"Visual warning in direct field of driver's view",null,null,{"$f":"D13","v":0}]
[null,null,"Type of warning",null,null,{"$f":"IF(D14=\"\",\"\",IF(D14<>\"Other\",\"Pass\",\"Fail\"))","v":""}]
[null,null,"General requirements assessment",{"$f":"IF(COUNTIFS(F10:F14,\"Pass\")=4,0.5,0)","v":0}]
[null,null,"Advanced Functions - Conditional speed limits","OEM Prediction","Lab Verification"]
[null,2,"Weather - Rain / Wetness",null,null,{"$f":"IF(AND(D17=\"Pass\",E17=\"No discrepancy\"),B17,0)","v":0}]
[null,2,"Weather - Snow / Icy",null,null,{"$f":"IF(AND(D18=\"Pass\",E18=\"No discrepancy\"),B18,0)","v":0}]
[null,3,"Time",null,null,0]
[null,1,"Distance For / In",null,null,0]
[null,1,"Arrows",null,null,0]
[null,1,"Vehicle Categories",null,null,0]
[null,2,"Implicit Speed Limits - Highway / Motorway",null,null,0]
[null,3,"Implicit Speed Limits - City Entry / Exit",null,null,0]
[null,2,"Implicit Speed Limits - Residential Zones",null,null,0]
[null,3,"Dynamic Speed Limits",null,null,0]
[null,null,"Conditional speed limits total",null,null,{"$f":"SUM(F17:F26)","v":0}]
[null,null,"Advanced Functions - Road features"]
[null,2,"Curves",null,null,{"$f":"IF(AND(D29=\"Pass\",E29=\"No discrepancy\",LEFT(D$55,1)=\"I\"),B29,0)","v":0}]
[null,2,"Roundabouts",null,null,{"$f":"IF(AND(D30=\"Pass\",E30=\"No discrepancy\",LEFT(D$55,1)=\"I\"),B30,0)","v":0}]
[null,1,"Junctions",null,null,0]
[null,2,"Traffic lights",null,null,{"$f":"IF(AND(D32=\"Pass\",E32=\"No discrepancy\"),B32,0)","v":0}]
[null,1,"Stop signs",null,null,{"$f":"IF(AND(D33=\"Pass\",E33=\"No discrepancy\"),B33,0)","v":0}]
[null,1,"Yield/Give way signs",null,null,0]
[null,1,"No entry",null,null,0]
[null,null,"Road features total",null,null,{"$f":"SUM(F29:F35)","v":0}]
[null,null,"Advanced Functions - Local hazards"]
[null,2,"Traffic jams",null,null,{"$f":"IF(AND(D38=\"Pass\",E38=\"No discrepancy\"),B38,0)","v":0}]
[null,1,"Construction zones",null,null,{"$f":"IF(AND(D39=\"Pass\",E39=\"No discrepancy\"),B39,0)","v":0}]
[null,1,"Accident ahead",null,null,0]
[null,1,"Wrong way driver",null,null,0]
[null,1,"Stopped vehicle on hard shoulder",null,null,0]
[null,1,"Items in road (including animals, people, debris etc.)",null,null,0]
[null,1,"Poor road conditions (including slippery roads)",null,null,0]
[null,1,"Poor weather conditions (including fog, heavy rain, etc.)",null,null,0]
[null,1,"Emergency vehicle",null,null,0]
[null,null,"Local hazards total",null,null,{"$f":"SUM(F38:F46)","v":0}]
[null,null,"Advanced Functions - System updates"]
[null,null,null,null,null,{"$f":"IF(D49=\"Quarterly\",5,IF(D49=\"Continuous\",10,0))","v":0}]
[null,null,"System updates total",null,null,{"$f":"F49","v":0}]
[]
[null,"SPEED LIMIT INFORMATION FUNCTION RESULT",null,{"$f":"IF(D15=0,0,D15+F27*(0.25/20)+F36*(0.25/10)+F47*(0.25/10)+F50*(0.25/10))","v":0}]
[]
[null,"SPEED CONTROL FUNCTION"]
[null,null,"Speed control function type (setting Vadj)"]
[null,null,"Speed control:"]
[null,null,"50 km/h test"]
[null,null,"Vstab",null,null,{"$f":"IF(AND(D58<>\"\",D58>=45),\"Pass\",\"Fail\")","v":"Fail"}]
[null,null,"difference between Vstab and Vadj",{"$f":"IF(D58=\"\",\"\",50-D58)","v":""}]
[null,null,"80 km/h test"]
[null,null,"Vstab",null,null,{"$f":"IF(AND(D61<>\"\",D61>=75),\"Pass\",\"Fail\")","v":"Fail"}]
[null,null,"difference between Vstab and Vadj",{"$f":"IF(D61=\"\",\"\",80-D61)","v":""}]
[null,null,"120 km/h test"]
[null,null,"Vstab",null,null,{"$f":"IF(AND(D64<>\"\",D64>=115),\"Pass\",\"Fail\")","v":"Fail"}]
[null,null,"difference between Vstab and Vadj",{"$f":"IF(D64=\"\",\"\",120-D64)","v":""}]
[null,"SPEED CONTROL FUNCTION RESULT",null,{"$f":"IF(AND(D59<=5,D62<=5,D65<=5),IF(OR(D55=\"Intelligent Speed Limiter default ON\",D55=\"Intelligent ACC\"),1.5,IF(D55=\"Intelligent Speed Limiter not default ON\",1,IF(D55=\"Speed limitation function\",0.5,0))),0)","v":0}]
[]
[null,"SUMMARY"]
[null,null,"Speed Limit Information Function",{"$f":"D52","v":0}]
[null,null,"Speed Control Function",{"$f":"D66","v":0}]
[]
[null,"TOTAL SAS",null,{"$f":"ROUND(SUM(D69:F70),Round)","v":0}]

{"sheet":"SA AEB Car-to-Car","index":21,"n_rows":135,"n_cols":33,"rows_kept":135,"cut":false,"hidden":false,"merged":[[79,3,79,4],[80,3,80,4],[78,3,78,4],[76,3,76,4],[77,3,77,4],[73,3,73,4],[87,1,87,2],[87,3,87,4],[87,5,87,7],[74,3,74,4],[88,3,88,4],[97,1,102,1],[95,3,95,7],[112,1,112,2],[112,3,112,7],[86,1,86,7],[108,3,109,3],[110,3,111,3],[105,1,105,7],[106,5,106,6],[106,3,107,4],[108,2,111,2],[106,7,107,7],[92,3,92,7],[89,3,89,4],[90,3,90,4],[91,3,91,4],[120,1,120,2],[120,3,120,7],[120,8,120,12],[81,1,81,2],[81,3,81,4],[81,8,81,9],[95,8,95,12],[103,1,103,2],[103,3,103,7],[103,8,103,12],[118,1,118,2],[118,3,118,12],[83,1,83,2],[83,3,83,7],[83,8,83,12],[114,3,114,12],[115,3,115,12],[116,3,116,4],[116,5,116,12],[117,3,117,4],[117,5,117,12],[94,1,94,12],[95,1,95,2],[92,1,92,2],[132,3,132,12],[134,1,134,2],[134,3,134,12],[127,3,127,12],[129,1,129,2],[129,3,129,12],[130,3,130,12],[131,3,131,12],[121,3,121,7],[121,8,121,12],[122,3,122,7],[122,8,122,12],[123,3,123,7],[123,8,123,12],[126,3,126,12],[125,3,125,7],[125,8,125,12],[124,3,124,7],[124,8,124,12],[72,3,72,4],[75,3,75,4],[71,3,71,4],[65,3,65,4],[66,3,66,4],[64,3,64,4],[67,3,67,4],[68,3,68,4],[69,3,69,4],[70,3,70,4],[62,3,62,4],[63,3,63,4],[60,1,60,2],[57,1,57,2],[57,3,57,7],[59,1,59,12],[60,3,60,4],[61,3,61,4],[11,8,11,12],[13,3,13,7],[13,8,13,12],[16,1,16,2],[50,1,50,2],[50,3,50,4],[50,5,50,7],[51,3,51,4],[56,3,56,4],[51,5,51,7],[53,3,53,4],[53,5,53,7],[56,5,56,7],[54,3,54,7],[55,3,55,4],[55,5,55,7],[52,3,52,4],[52,5,52,7],[7,8,7,12],[8,3,8,7],[8,8,8,12],[10,3,10,7],[10,8,10,12],[7,3,7,7],[11,3,11,7],[17,8,17,12],[18,8,18,12],[19,8,19,12],[20,8,20,12],[32,8,32,12],[21,8,21,12],[22,8,22,12],[23,8,23,12],[24,8,24,12],[25,8,25,12],[49,1,49,7],[14,1,14,2],[14,3,14,12],[12,3,12,7],[12,8,12,12],[4,8,4,12],[5,3,5,7],[5,8,5,12],[6,3,6,7],[6,8,6,12],[4,3,4,7],[1,8,1,12],[2,1,2,2],[2,3,2,7],[2,8,2,12],[3,3,3,7],[3,8,3,12],[3,1,3,2],[1,1,1,2],[1,3,1,7],[34,1,34,2],[47,1,47,2],[47,3,47,7],[28,3,28,7],[29,3,29,7],[30,3,30,7],[31,3,31,7],[32,1,32,2],[32,3,32,7],[17,1,31,1],[26,3,26,7],[27,3,27,7],[35,1,46,1]]}
[3]
[null,"AEB CAR-TO-CAR",null,"AEB",null,null,null,null,"FCW"]
[null,{"$f":"'General Overview'!G16","v":""}]
[null,"SYSTEM DETAILS"]
[null,null,"System name",null,null,null,null,null,null,null,null,null,null,{"$f":"D5","v":0}]
[null,null,"AEB and/or FCW"]
[null,null,"Functionality",null,null,null,null,null,null,null,null,null,null,{"$f":"D7","v":0},{"$f":"E7","v":0}]
[null,null,"Speed range (km/h) - Minimum",null,null,null,null,null,null,null,null,null,null,{"$f":"D8","v":0},{"$f":"E8","v":0}]
[null,null,"Maximum",null,null,null,null,null,null,null,null,null,null,0,0]
[]
[null,"PREREQUISITES"]
[null,null,"Default ON after every journey"]
[null,null,"Loud and Clear FCW"]
[null,null,"System switches off below 130 km/h"]
[null,"PREREQUISITES",null,{"$f":"IF(AND(D12=\"PASS\",D13=\"PASS\",D14=\"NO\",I12=\"PASS\",I13=\"PASS\",I14=\"NO\",'AOP Whiplash'!D73>=2.25),\"PASS\",\"FAIL\")","v":"FAIL"}]
[]
[null,"CCRs",null,-0.5,-0.75,1,0.75,0.5,-0.5,-0.75,1,0.75,0.5]
[null,"Test Speed",10]
[null,null,15]
[null,null,20]
[null,null,25]
[null,null,30]
[null,null,35]
[null,null,40]
[null,null,45]
[null,null,50]
[null,null,55]
[null,null,60]
[null,null,65]
[null,null,70]
[null,null,75]
[null,null,80]
[null,"Predicted CCRs score",null,0,null,null,null,null,0]
[]
[null,"CCRm",null,-0.5,-0.75,1,0.75,0.5]
[null,"Test Speed",30]
[null,null,35]
[null,null,40]
[null,null,45]
[null,null,50]
[null,null,55]
[null,null,60]
[null,null,65]
[null,null,70]
[null,null,75]
[null,null,80]
[null,null,"130 km/h vs 70 km/h GVT (verification)"]
[null,"Predicted CCRm score",null,0]
[]
[null,"CCRb"]
[null,"Testpoints CCRb",null,"Impact Speed",null,"Points"]
[null,null,"12m headway"]
[null,null,"-2m/s² EVT acceleration",null,null,{"$f":"IF(D53=\"Green\",1,IF(D53=\"Yellow\",0.75,IF(D53=\"Orange\",0.5,IF(D53=\"Brown\",0.25,0))))","v":0}]
[null,null,"-6m/s² EVT acceleration",null,null,{"$f":"IF(D54=\"Green\",1,IF(D54=\"Yellow\",0.75,IF(D54=\"Orange\",0.5,IF(D54=\"Brown\",0.25,0))))","v":0}]
[null,null,"40m headway"]
[null,null,"-2m/s² EVT acceleration",null,null,{"$f":"IF(D56=\"Green\",1,IF(D56=\"Yellow\",0.75,IF(D56=\"Orange\",0.5,IF(D56=\"Brown\",0.25,0))))","v":0}]
[null,null,"-6m/s² EVT acceleration",null,null,{"$f":"IF(D57=\"Green\",1,IF(D57=\"Yellow\",0.75,IF(D57=\"Orange\",0.5,IF(D57=\"Brown\",0.25,0))))","v":0}]
[null,"CCRb RESULT",null,{"$f":"SUM(F53:H54,F56:H57)/4","v":0}]
[]
[null,"VERIFICATION TESTS"]
[null,null,null,"Testpoint",null,"Prediction","Vimpact","Points","Testpoint","ESS","Prediction","Vimpact","Points"]
[null,null,null,null,null,null,null,{"$f":"IF(G62=\"\",\"\",actual_AEB_score(D62,G62,F62))","v":""},null,null,null,null,{"$f":"IF(L62=\"\",\"\",actual_AEB_score(I62,L62,K62))","v":""}]
[null,null,null,null,null,null,null,{"$f":"IF(G63=\"\",\"\",actual_AEB_score(D63,G63,F63))","v":""},null,null,null,null,{"$f":"IF(L63=\"\",\"\",actual_AEB_score(I63,L63,K63))","v":""}]
[null,null,null,null,null,null,null,{"$f":"IF(G64=\"\",\"\",actual_AEB_score(D64,G64,F64))","v":""},null,null,null,null,{"$f":"IF(L64=\"\",\"\",actual_AEB_score(I64,L64,K64))","v":""}]
[null,null,null,null,null,null,null,{"$f":"IF(G65=\"\",\"\",actual_AEB_score(D65,G65,F65))","v":""},null,null,null,null,{"$f":"IF(L65=\"\",\"\",actual_AEB_score(I65,L65,K65))","v":""}]
[null,null,null,null,null,null,null,{"$f":"IF(G66=\"\",\"\",actual_AEB_score(D66,G66,F66))","v":""},null,null,null,null,{"$f":"IF(L66=\"\",\"\",actual_AEB_score(I66,L66,K66))","v":""}]
[null,null,null,null,null,null,null,{"$f":"IF(G67=\"\",\"\",actual_AEB_score(D67,G67,F67))","v":""},null,null,null,null,{"$f":"IF(L67=\"\",\"\",actual_AEB_score(I67,L67,K67))","v":""}]
[null,null,null,null,null,null,null,{"$f":"IF(G68=\"\",\"\",actual_AEB_score(D68,G68,F68))","v":""},null,null,null,null,{"$f":"IF(L68=\"\",\"\",actual_AEB_score(I68,L68,K68))","v":""}]
[null,null,null,null,null,null,null,{"$f":"IF(G69=\"\",\"\",actual_AEB_score(D69,G69,F69))","v":""},null,null,null,null,{"$f":"IF(L69=\"\",\"\",actual_AEB_score(I69,L69,K69))","v":""}]
[null,null,null,null,null,null,null,{"$f":"IF(G70=\"\",\"\",actual_AEB_score(D70,G70,F70))","v":""},null,null,null,null,{"$f":"IF(L70=\"\",\"\",actual_AEB_score(I70,L70,K70))","v":""}]
[null,null,null,null,null,null,null,{"$f":"IF(G71=\"\",\"\",actual_AEB_score(D71,G71,F71))","v":""},null,null,null,null,{"$f":"IF(L71=\"\",\"\",actual_AEB_score(I71,L71,K71))","v":""}]
[null,null,null,null,null,null,null,{"$f":"IF(G72=\"\",\"\",actual_AEB_score(D72,G72,F72))","v":""},null,null,null,null,{"$f":"IF(L72=\"\",\"\",actual_AEB_score(I72,L72,K72))","v":""}]
[null,null,null,null,null,null,null,{"$f":"IF(G73=\"\",\"\",actual_AEB_score(D73,G73,F73))","v":""},null,null,null,null,{"$f":"IF(L73=\"\",\"\",actual_AEB_score(I73,L73,K73))","v":""}]
[null,null,null,null,null,null,null,{"$f":"IF(G74=\"\",\"\",actual_AEB_score(D74,G74,F74))","v":""},null,null,null,null,{"$f":"IF(L74=\"\",\"\",actual_AEB_score(I74,L74,K74))","v":""}]
[null,null,null,null,null,null,null,{"$f":"IF(G75=\"\",\"\",actual_AEB_score(D75,G75,F75))","v":""},null,null,null,null,{"$f":"IF(L75=\"\",\"\",actual_AEB_score(I75,L75,K75))","v":""}]
[null,null,null,null,null,null,null,{"$f":"IF(G76=\"\",\"\",actual_AEB_score(D76,G76,F76))","v":""},null,null,null,null,{"$f":"IF(L76=\"\",\"\",actual_AEB_score(I76,L76,K76))","v":""}]
[null,null,null,null,null,null,null,{"$f":"IF(G77=\"\",\"\",actual_AEB_score(D77,G77,F77))","v":""},null,null,null,null,{"$f":"IF(L77=\"\",\"\",actual_AEB_score(I77,L77,K77))","v":""}]
[null,null,null,null,null,null,null,{"$f":"IF(G78=\"\",\"\",actual_AEB_score(D78,G78,F78))","v":""},null,null,null,null,{"$f":"IF(L78=\"\",\"\",actual_AEB_score(I78,L78,K78))","v":""}]
[null,null,null,null,null,null,null,{"$f":"IF(G79=\"\",\"\",actual_AEB_score(D79,G79,F79))","v":""},null,null,null,null,{"$f":"IF(L79=\"\",\"\",actual_AEB_score(I79,L79,K79))","v":""}]
[null,null,null,null,null,null,null,{"$f":"IF(G80=\"\",\"\",actual_AEB_score(D80,G80,F80))","v":""},null,null,null,null,{"$f":"IF(L80=\"\",\"\",actual_AEB_score(I80,L80,K80))","v":""}]
[null,null,null,null,null,null,null,{"$f":"IF(G81=\"\",\"\",actual_AEB_score(D81,G81,F81))","v":""},null,null,null,null,{"$f":"IF(L81=\"\",\"\",actual_AEB_score(I81,L81,K81))","v":""}]
[null,"Total",null,null,null,{"$f":"(COUNTIF(F62:F81,\"Green\")*1)+(COUNTIF(F62:F81,\"Yellow\")*0.75)+(COUNTIF(F62:F81,\"Orange\")*0.5)+(COUNTIF(F62:F81,\"Brown\")*0.25)","v":0},null,{"$f":"SUM(H62:H81)","v":0},null,null,{"$f":"(COUNTIF(K62:K81,\"Green\")*1)+(COUNTIF(K62:K81,\"Yellow\")*0.75)+(COUNTIF(K62:K81,\"Orange\")*0.5)+(COUNTIF(K62:K81,\"Brown\")*0.25)","v":0},null,{"$f":"SUM(M62:M81)","v":0}]
[]
[null,"Correction factor",null,{"$f":"IF(F82=0,0,ROUND(H82/F82,Round))","v":0},null,null,null,null,{"$f":"IF(K82=0,0,ROUND(M82/K82,Round))","v":0}]
[]
[]
[null,"CCFtap"]
[null,"Testpoints CCFtap",null,"Test speed",null,"GVT speed"]
[null,null,null,null,null,"30 km/h","45 km/h","60 km/h"]
[null,null,null,"10 km/h"]
[null,null,null,"15 km/h"]
[null,null,null,"20 km/h"]
[null,"CCFtap RESULT",null,{"$f":"COUNTIF(F90:H92,\"Green\")/9","v":0}]
[]
[null,"CCCscp"]
[null,"Testpoints CCCscp",null,"GVT speed",null,null,null,null,"GVT speed",null,null,null,null,null,null,null,null,null,null,null,null,null,null,"20 km/h","30 km/h","40 km/h","50 km/h","60 km/h","20 km/h","30 km/h","40 km/h","50 km/h","60 km/h"]
[null,null,null,"20 km/h","30 km/h","40 km/h","50 km/h","60 km/h","20 km/h","30 km/h","40 km/h","50 km/h","60 km/h",null,null,null,null,null,null,null,null,null,"Start From Stop",0.5,0.5,0.5,0.5,0.5]
[null,"Test Speed","Start From Stop",null,null,null,null,null,null,null,null,null,null,null,null,null,null,null,null,null,null,null,20,1,0.25,0.25,0.25,0.25]
[null,null,20,null,null,null,null,null,null,null,null,null,null,null,null,null,null,null,null,null,null,null,30,1,1,0.25,0.25,0.25]
[null,null,30,null,null,null,null,null,null,null,null,null,null,null,null,null,null,null,null,null,null,null,40,1,1,1,0.25,0.25,1,1,1,0.25,0.25]
[null,null,40,null,null,null,null,null,null,null,null,null,null,null,null,null,null,null,null,null,null,null,50,1,1,1,1,0.25,1,1,1,1,0.25]
[null,null,50,null,null,null,null,null,null,null,null,null,null,null,null,null,null,null,null,null,null,null,60,1,1,1,1,1,1,1,1,1,1]
[null,null,60,null,null,null,null,null,null,null,null,null,null,null,null,null,null,null,null,null,null,null,"Start From Stop",{"$f":"IF(OR(D98=\"\",D98=\"Red\"),0,X97)","v":0},{"$f":"IF(OR(E98=\"\",E98=\"Red\"),0,Y97)","v":0},0,0,0]
[null,"CCCscp RESULT",null,{"$f":"X109/20","v":0},null,null,null,null,{"$f":"AC109/12.75","v":0},null,null,null,null,null,null,null,null,null,null,null,null,null,20,{"$f":"IF(OR(D99=\"\",D99=\"Red\"),0,X98)","v":0},{"$f":"IF(OR(E99=\"\",E99=\"Red\"),0,Y98)","v":0},{"$f":"IF(OR(F99=\"\",F99=\"Red\"),0,Z98)","v":0},{"$f":"IF(OR(G99=\"\",G99=\"Red\"),0,AA98)","v":0},{"$f":"IF(OR(H99=\"\",H99=\"Red\"),0,AB98)","v":0}]
[null,null,null,null,null,null,null,null,null,null,null,null,null,null,null,null,null,null,null,null,null,null,30,0,0,0,0,0]
[null,"Car-to-Car Head On",null,null,null,null,null,null,null,null,null,null,null,null,null,null,null,null,null,null,null,null,40,{"$f":"IF(OR(D101=\"\",D101=\"Red\"),0,IF(D101=\"Orange\",X100/2,X100))","v":0},{"$f":"IF(OR(E101=\"\",E101=\"Red\"),0,IF(E101=\"Orange\",Y100/2,Y100))","v":0},0,0,0,0,0,0,0,0]
[null,null,null,"Test speed",null,"GVT speed",null,"Points",null,null,null,null,null,null,null,null,null,null,null,null,null,null,50,{"$f":"IF(OR(D102=\"\",D102=\"Red\"),0,IF(D102=\"Orange\",X101/2,X101))","v":0},0,0,0,0,0,0,0,0,0]
[null,null,null,null,null,"50 km/h","70 km/h",null,null,null,null,null,null,null,null,null,null,null,null,null,null,null,60,0,0,0,0,0,0,0,0,0,0]
[null,null,"Speed Reduction","CCFhos","50 km/h",null,null,{"$f":"IF(F109>=20,0.25,IF(AND(F109<20,F109>=10),0.125,0))","v":0},null,null,null,null,null,null,null,null,null,null,null,null,null,null,null,{"$f":"SUM(X103:AB108)","v":0},null,null,null,null,{"$f":"SUM(AC106:AG108)","v":0}]
[null,null,null,null,"70 km/h",null,null,{"$f":"IF(G110>=20,0.25,IF(AND(G110<20,G110>=10),0.125,0))","v":0}]
[null,null,null,"CCFhol","50 km/h",null,null,{"$f":"IF(F111>=20,0.25,IF(AND(F111<20,F111>=10),0.125,0))","v":0}]
[null,null,null,null,"70 km/h",null,null,{"$f":"IF(G112>=20,0.25,IF(AND(G112<20,G112>=10),0.125,0))","v":0}]
[null,"Car-to-Car Head On RESULT",null,{"$f":"SUM(H109:H112)","v":0}]
[]
[null,"HMI"]
[null,null,"Additional HMI features"]
[null,null,"Suplementary warning",null,null,{"$f":"IF(D117=\"Yes\",1,0)","v":0}]
[null,null,"Restraint activation / dynamic retractors / ESS",null,null,{"$f":"IF(D118=\"Yes\",1,0)","v":0}]
[null,"HMI RESULT",null,{"$f":"SUM(F117:M118)/2","v":0}]
[]
[null,"SUMMARY"]
[null,null,"CCRs (prediction x correction factor)",{"$f":"IF(COUNTIF(D18:H20,\"Red\")>=1,0,IF('AOP Whiplash'!D73>=2.25,MIN(D33*D84,1),0))","v":0},null,null,null,null,{"$f":"MIN(I33*I84,1)","v":0}]
[null,null,"CCRm (prediction x correction factor)",{"$f":"MIN(D48*D84,1)","v":0}]
[null,null,"CCRb",{"$f":"D58","v":0}]
[null,null,"CCFtap",{"$f":"D93","v":0}]
[null,null,"CCCscp",{"$f":"D104","v":0},null,null,null,null,{"$f":"I104","v":0}]
[null,null,"Car-to-Car Head On",{"$f":"D113","v":0}]
[null,null,"HMI",{"$f":"D119","v":0}]
[]
[null,"TOTAL"]
[null,null,"AEB",{"$f":"ROUND(D122+D123+D124+D125+(D126*2)+D127,Round)","v":0}]
[null,null,"FCW",{"$f":"ROUND((I122*0.5)+I126,Round)","v":0}]
[null,null,"HMI",{"$f":"D128*0.5","v":0}]
[]
[null,"TOTAL AEB CAR-TO-CAR",null,{"$f":"IF(D15=\"PASS\",SUM(D131:M133),0)","v":0}]

{"sheet":"SA LSS","index":22,"n_rows":78,"n_cols":16,"rows_kept":78,"cut":false,"hidden":false,"merged":[[30,1,30,2],[25,3,25,8],[26,3,26,8],[27,3,27,8],[29,3,29,8],[25,9,25,14],[26,9,26,14],[27,9,27,14],[29,9,29,14],[30,3,30,14],[28,3,28,8],[28,9,28,14],[18,3,18,8],[16,3,16,8],[16,9,16,14],[17,9,17,14],[18,9,18,14],[24,3,24,8],[24,9,24,14],[19,3,19,8],[21,3,21,8],[19,9,19,14],[21,9,21,14],[22,3,22,8],[22,9,22,14],[20,3,20,8],[20,9,20,14],[6,3,6,14],[1,1,2,2],[3,1,3,2],[4,3,4,14],[5,3,5,14],[1,3,3,14],[13,1,13,2],[13,3,13,14],[14,1,14,14],[15,3,15,14],[7,3,7,14],[8,3,8,14],[9,3,9,14],[10,1,10,14],[11,3,11,14],[12,3,12,14],[54,1,54,2],[54,3,54,14],[38,3,38,8],[52,3,52,14],[38,9,38,14],[40,3,40,8],[40,9,40,14],[37,1,37,2],[37,3,37,14],[23,1,23,2],[23,3,23,14],[34,3,34,14],[41,3,41,8],[41,9,41,14],[42,3,42,8],[42,9,42,14],[17,3,17,8],[43,3,43,8],[43,9,43,14],[31,3,31,14],[32,3,32,14],[33,3,33,14],[36,3,36,14],[56,3,56,8],[56,9,56,14],[44,3,44,8],[44,9,44,14],[35,3,35,14],[39,3,39,8],[52,1,52,2],[53,1,53,14],[55,1,55,14],[45,3,45,8],[45,9,45,14],[47,3,47,8],[47,9,47,14],[48,3,48,8],[48,9,48,14],[49,3,49,8],[49,9,49,14],[50,3,50,8],[50,9,50,14],[51,3,51,8],[51,9,51,14],[46,3,46,8],[57,3,57,5],[57,6,57,8],[57,9,57,11],[57,12,57,14],[60,3,60,5],[60,6,60,8],[60,9,60,11],[60,12,60,14],[62,3,62,5],[62,6,62,8],[62,9,62,11],[62,12,62,14],[58,3,58,5],[58,6,58,8],[58,9,58,11],[58,12,58,14],[59,3,59,5],[59,6,59,8],[59,9,59,11],[59,12,59,14],[61,3,61,5],[61,6,61,8],[61,9,61,11],[61,12,61,14],[75,3,75,14],[76,1,76,14],[77,1,77,2],[77,3,77,14],[71,1,71,14],[72,1,72,2],[72,3,72,14],[73,3,73,14],[74,3,74,14],[66,1,66,14],[67,3,67,14],[68,3,68,14],[69,3,69,14],[70,1,70,2],[70,3,70,14],[63,1,63,2],[63,3,63,8],[63,9,63,14],[64,1,64,14],[65,1,65,2],[65,3,65,14]]}
[3]
[null,"Lane Support Systems"]
[]
[null,{"$f":"'General Overview'!G17","v":""}]
[null,"SYSTEM DETAILS"]
[null,null,"System Name",null,null,null,null,null,null,null,null,null,null,null,null,{"$f":"D6","v":0}]
[null,null,"Default ON (partly)"]
[null,null,"Functionality"]
[null,null,"Speed range (km/h) - Minimum",null,null,null,null,null,null,null,null,null,null,null,null,{"$f":"D9","v":0}]
[null,null,"Maximum",null,null,null,null,null,null,null,null,null,null,null,null,{"$f":"D10","v":0}]
[]
[null,"PREREQUISITES"]
[null,null,"ESC meeting R13H"]
[null,"PREREQUISITES",null,{"$f":"IF(AND(D13=\"YES\"),\"PASS\",\"FAIL\")","v":"FAIL"}]
[]
[null,"Emergency Lane Keeping"]
[null,null,"Road Edge","No line (road edge only)",null,null,null,null,null,"Dashed centre line"]
[null,null,0.2]
[null,null,0.3]
[null,null,0.4]
[null,null,0.5]
[null,null,0.6]
[null,null,null,{"$f":"IF(OR(COUNTIF(D18:I22,\">=-0.1\")=5,COUNTIF(D18:I22,\">=-0,1\")=5),0.25,0)","v":0},null,null,null,null,null,{"$f":"IF(OR(COUNTIF(J18:O22,\">=-0.1\")=5,COUNTIF(J18:O22,\">=-0,1\")=5),0.25,0)","v":0}]
[null,"ELK Road Edge assessment",null,{"$f":"SUM(D23:O23)","v":0}]
[null,null,"Solid Line","Driver side",null,null,null,null,null,"Passenger side"]
[null,null,0.2]
[null,null,0.3]
[null,null,0.4]
[null,null,0.5]
[null,null,0.6]
[null,"ELK Solid Line assessment",null,{"$f":"IF(OR(COUNTIF(D26:O30,\">=-0.3\")=10,COUNTIF(D26:O30,\">=-0,3\")=10),0.5,0)","v":0}]
[null,null,"Oncoming vehicle"]
[null,null,0.2]
[null,null,0.3]
[null,null,0.4]
[null,null,0.5]
[null,null,0.6]
[null,"ELK Oncoming vehicle assessment",null,{"$f":"IF(COUNTIF(D33:O37,\"PASS\")=5,0.5,0)","v":0}]
[null,null,"Overtaking vehicle (GVT @ 72km/h)","Unintentional",null,null,null,null,null,"Intentional"]
[null,null,0.2]
[null,null,0.3]
[null,null,0.4]
[null,null,0.5]
[null,null,0.6]
[null,null,0.7]
[null,null,"Overtaking vehicle (GVT @ 80km/h)"]
[null,null,0.2]
[null,null,0.3]
[null,null,0.4]
[null,null,0.5]
[null,null,0.6]
[null,null,0.7]
[null,"ELK Overtaking vehicle assessment",null,{"$f":"IF(COUNTIF(D40:O52,\"PASS\")=16,0.5,0)","v":0}]
[]
[null,"ELK RESULT",null,{"$f":"SUM(D24,D31,D38,D53)","v":0}]
[]
[null,"Lane Keep Assist",null,"Dashed Line",null,null,null,null,null,"Solid Line"]
[null,null,null,"Driver side",null,null,"Passenger side",null,null,"Driver side",null,null,"Passenger side"]
[null,null,0.2]
[null,null,0.3]
[null,null,0.4]
[null,null,0.5]
[null,null,0.6]
[null,"LKA assessment",null,{"$f":"IF(OR(COUNTIF(D59:I63,\">=-0.3\")=10,COUNTIF(D59:I63,\">=-0.3\")=10),0.25,0)","v":0},null,null,null,null,null,{"$f":"IF(OR(COUNTIF(J59:O63,\">=-0.3\")=10,COUNTIF(J59:O63,\">=-0,3\")=10),0.25,0)","v":0}]
[]
[null,"LKA RESULT",null,{"$f":"SUM(D64,J64)","v":0}]
[]
[null,"HMI"]
[null,1,"Lane Departure Warning"]
[null,2,"Blind Spot Monitoring"]
[null,"HMI RESULT",null,{"$f":"IF(OR(D69=\"PASS\",D70=\"PASS\"),0.5,0)","v":0}]
[]
[null,"SUMMARY"]
[null,null,"ELK",{"$f":"D55","v":0}]
[null,null,"LKA",{"$f":"D66","v":0}]
[null,null,"HMI",{"$f":"D71","v":0}]
[]
[null,"TOTAL Lane Support Systems",null,{"$f":"IF(D14=\"FAIL\",0,ROUND(SUM(D74:O76),Round))","v":0}]

{"sheet":"Datasheet","index":23,"n_rows":491,"n_cols":29,"rows_kept":491,"cut":false,"hidden":false,"merged":[[479,1,485,5],[224,2,224,3],[224,4,224,5]]}
[null,"Reference Number","999"]
[null,"Active bonnet",{"$f":"IF(OR('General Overview'!E52:E53=\"Standard\"),\"Standard\",IF(OR('General Overview'!E52:E53=\"Optional meeting fitment\"),\"Optional meeting fitment\",IF(OR('General Overview'!E52:E53=\"Optional not meeting fitment\"),\"Optional not meeting fitment\",\"Not available\")))","v":"Not available"}]
[null,"AEB-VRU fitment",{"$f":"IF(OR('General Overview'!E57:E58=\"Standard\"),\"Standard\",IF(OR('General Overview'!E57:E58=\"Optional meeting fitment\"),\"Optional meeting fitment\",IF(OR('General Overview'!E57:E58=\"Optional not meeting fitment\"),\"Optional not meeting fitment\",\"Not available\")))","v":"Not available"}]
[null,"MPDB Image type",{"$f":"IF(NOT(ISERROR(FIND(\"Off-Road\",'General Overview'!C19))),\"SUV\",\"Car\")","v":"Car"}]
["---->>","Type Approval Number"]
[null,"Is electric"]
[null,"Frontal Points",{"$f":"ROUND('OVERALL RATING'!D7+'OVERALL RATING'!D8,1)","v":0}]
[null,"Frontal Max Points",{"$f":"SUM(C33,C43)","v":16}]
[null,"Frontal Colour",{"$f":"IF(C7/C8>0.75,\"Green\",IF(C7/C8>0.5,\"Yellow\",IF(C7/C8>0.25,\"Orange\",IF(C7/C8>0,\"Brown\",\"Red\"))))","v":"Red"}]
[null,"Lateral Points",{"$f":"ROUND('OVERALL RATING'!D9+'OVERALL RATING'!D10+'OVERALL RATING'!D11,1)","v":0}]
[null,"Lateral Max Points",{"$f":"C59+C51+C69","v":16}]
[null,"Lateral Colour",{"$f":"IF(C10/C11>0.75,\"Green\",IF(C10/C11>0.5,\"Yellow\",IF(C10/C11>0.25,\"Orange\",IF(C10/C11>0,\"Brown\",\"Red\"))))","v":"Red"}]
[null,"Rear Points",{"$f":"ROUND('OVERALL RATING'!D12,1)","v":0}]
[null,"Rear Max Points",{"$f":"C73","v":4}]
[null,"Rear Colour",{"$f":"IF(C13/C14>0.75,\"Green\",IF(C13/C14>0.5,\"Yellow\",IF(C13/C14>0.25,\"Orange\",IF(C13/C14>0,\"Brown\",\"Red\"))))","v":"Red"}]
[]
[]
[]
[null,null,null,null,null,null,null,null,"MPDB Deformations",null,null,null,null,null,null,null,null,"MPDB Deformation Colours"]
[null,null,null,null,null,null,null,null,null,{"$f":"'AOP Frontal MPDB'!E121","v":"Enter X-deformation"},"Col_1","Col_2","Col_3","Col_4","Col_5","Col_6",null,{"$f":"'AOP Frontal MPDB'!M137","v":0}]
[null,"MPDB",null,"Driver",null,"Passenger",null,null,null,"Nr cells averaged",{"$f":"IF(6*CEILING(('AOP Frontal MPDB'!$N$143-'AOP Frontal MPDB'!$M$143+1)/6,1)-('AOP Frontal MPDB'!$N$143-'AOP Frontal MPDB'!$M$143+1)>=1,FLOOR(('AOP Frontal MPDB'!$N$143-'AOP Frontal MPDB'!$M$143+1)/6,1),CEILING(('AOP Frontal MPDB'!$N$143-'AOP Frontal MPDB'!$M$143+1)/6,1))","v":-2},{"$f":"IF(6*CEILING(('AOP Frontal MPDB'!$N$143-'AOP Frontal MPDB'!$M$143+1)/6,1)-('AOP Frontal MPDB'!$N$143-'AOP Frontal MPDB'!$M$143+1)>=3,FLOOR(('AOP Frontal MPDB'!$N$143-'AOP Frontal MPDB'!$M$143+1)/6,1),CEILING(('AOP Frontal MPDB'!$N$143-'AOP Frontal MPDB'!$M$143+1)/6,1))","v":-2},{"$f":"IF(6*CEILING(('AOP Frontal MPDB'!$N$143-'AOP Frontal MPDB'!$M$143+1)/6,1)-('AOP Frontal MPDB'!$N$143-'AOP Frontal MPDB'!$M$143+1)>=5,FLOOR(('AOP Frontal MPDB'!$N$143-'AOP Frontal MPDB'!$M$143+1)/6,1),CEILING(('AOP Frontal MPDB'!$N$143-'AOP Frontal MPDB'!$M$143+1)/6,1))","v":-1},{"$f":"IF(6*CEILING(('AOP Frontal MPDB'!$N$143-'AOP Frontal MPDB'!$M$143+1)/6,1)-('AOP Frontal MPDB'!$N$143-'AOP Frontal MPDB'!$M$143+1)>=6,FLOOR(('AOP Frontal MPDB'!$N$143-'AOP Frontal MPDB'!$M$143+1)/6,1),CEILING(('AOP Frontal MPDB'!$N$143-'AOP Frontal MPDB'!$M$143+1)/6,1))","v":-1},{"$f":"IF(6*CEILING(('AOP Frontal MPDB'!$N$143-'AOP Frontal MPDB'!$M$143+1)/6,1)-('AOP Frontal MPDB'!$N$143-'AOP Frontal MPDB'!$M$143+1)>=4,FLOOR(('AOP Frontal MPDB'!$N$143-'AOP Frontal MPDB'!$M$143+1)/6,1),CEILING(('AOP Frontal MPDB'!$N$143-'AOP Frontal MPDB'!$M$143+1)/6,1))","v":-2},{"$f":"IF(6*CEILING(('AOP Frontal MPDB'!$N$143-'AOP Frontal MPDB'!$M$143+1)/6,1)-('AOP Frontal MPDB'!$N$143-'AOP Frontal MPDB'!$M$143+1)>=2,FLOOR(('AOP Frontal MPDB'!$N$143-'AOP Frontal MPDB'!$M$143+1)/6,1),CEILING(('AOP Frontal MPDB'!$N$143-'AOP Frontal MPDB'!$M$143+1)/6,1))","v":-2},null,null,"Col_1","Col_2","Col_3","Col_4","Col_5","Col_6"]
[null,"Head colour",{"$f":"IF(OR(D22:D31=\"Red\",D22:D31=\"Brown\",D22:D31=\"Orange\",F22:F30=\"Red\",F22:F30=\"Brown\",F22:F30=\"Orange\"),TRUE,FALSE)","v":true},{"$f":"IF('AOP Frontal MPDB'!E24=4,\"Green\",IF('AOP Frontal MPDB'!E24>=2.67,\"Yellow\",IF('AOP Frontal MPDB'!E24>=1.33,\"Orange\",IF('AOP Frontal MPDB'!E24>0,\"Brown\",\"Red\"))))","v":"Red"},null,{"$f":"IF('AOP Frontal MPDB'!G24=4,\"Green\",IF('AOP Frontal MPDB'!G24>=2.67,\"Yellow\",IF('AOP Frontal MPDB'!G24>=1.33,\"Orange\",IF('AOP Frontal MPDB'!G24>0,\"Brown\",\"Red\"))))","v":"Red"},null,null,"Row_7",3,{"$f":"IF(J20=\"Enter X-deformation\",999,AVERAGEIFS('AOP Frontal MPDB'!$N$148:$N$1547,'AOP Frontal MPDB'!$L$148:$L$1547,\">=\"&'AOP Frontal MPDB'!$M$143,'AOP Frontal MPDB'!$L$148:$L$1547,\"<\"&'AOP Frontal MPDB'!$M$143+SUM($J$21:K$21),'AOP Frontal MPDB'!$K$148:$K$1547,\"<=\"&'AOP Frontal MPDB'!$I$144,'AOP Frontal MPDB'!$K$148:$K$1547,\">\"&'AOP Frontal MPDB'!$I$144-SUM($J$21:$J22)))","v":999},{"$f":"IF(J20=\"Enter X-deformation\",999,AVERAGEIFS('AOP Frontal MPDB'!$N$148:$N$1547,'AOP Frontal MPDB'!$L$148:$L$1547,\">=\"&'AOP Frontal MPDB'!$M$143+K21,'AOP Frontal MPDB'!$L$148:$L$1547,\"<\"&'AOP Frontal MPDB'!$M$143+SUM($K$21:L21),'AOP Frontal MPDB'!$K$148:$K$1547,\"<=\"&'AOP Frontal MPDB'!$I$144,'AOP Frontal MPDB'!$K$148:$K$1547,\">\"&'AOP Frontal MPDB'!$I$144-4))","v":999},{"$f":"IF($J$20=\"Enter X-deformation\",999,AVERAGEIFS('AOP Frontal MPDB'!$N$148:$N$1547,'AOP Frontal MPDB'!$L$148:$L$1547,\">=\"&'AOP Frontal MPDB'!$M$143+SUM($K$21:L21),'AOP Frontal MPDB'!$L$148:$L$1547,\"<\"&'AOP Frontal MPDB'!$M$143+SUM($K$21:M21),'AOP Frontal MPDB'!$K$148:$K$1547,\"<=\"&'AOP Frontal MPDB'!$I$144,'AOP Frontal MPDB'!$K$148:$K$1547,\">\"&'AOP Frontal MPDB'!$I$144-4))","v":999},{"$f":"IF($J$20=\"Enter X-deformation\",999,AVERAGEIFS('AOP Frontal MPDB'!$N$148:$N$1547,'AOP Frontal MPDB'!$L$148:$L$1547,\">=\"&'AOP Frontal MPDB'!$M$143+SUM($K$21:M21),'AOP Frontal MPDB'!$L$148:$L$1547,\"<\"&'AOP Frontal MPDB'!$M$143+SUM($K$21:N21),'AOP Frontal MPDB'!$K$148:$K$1547,\"<=\"&'AOP Frontal MPDB'!$I$144,'AOP Frontal MPDB'!$K$148:$K$1547,\">\"&'AOP Frontal MPDB'!$I$144-4))","v":999},{"$f":"IF($J$20=\"Enter X-deformation\",999,AVERAGEIFS('AOP Frontal MPDB'!$N$148:$N$1547,'AOP Frontal MPDB'!$L$148:$L$1547,\">=\"&'AOP Frontal MPDB'!$M$143+SUM($K$21:N21),'AOP Frontal MPDB'!$L$148:$L$1547,\"<\"&'AOP Frontal MPDB'!$M$143+SUM($K$21:O21),'AOP Frontal MPDB'!$K$148:$K$1547,\"<=\"&'AOP Frontal MPDB'!$I$144,'AOP Frontal MPDB'!$K$148:$K$1547,\">\"&'AOP Frontal MPDB'!$I$144-4))","v":999},{"$f":"IF($J$20=\"Enter X-deformation\",999,AVERAGEIFS('AOP Frontal MPDB'!$N$148:$N$1547,'AOP Frontal MPDB'!$L$148:$L$1547,\">=\"&'AOP Frontal MPDB'!$M$143+SUM($K$21:O21),'AOP Frontal MPDB'!$L$148:$L$1547,\"<\"&'AOP Frontal MPDB'!$M$143+SUM($K$21:P21),'AOP Frontal MPDB'!$K$148:$K$1547,\"<=\"&'AOP Frontal MPDB'!$I$144,'AOP Frontal MPDB'!$K$148:$K$1547,\">\"&'AOP Frontal MPDB'!$I$144-4))","v":999},null,"Row_7",{"$f":"IF($R$20=\"RHD\",IF(K22<160,\"Green\",IF(K22<320,\"Yellow\",IF(K22<480,\"Orange\",IF(K22<630,\"Brown\",\"Red\")))),IF(P22<160,\"Green\",IF(P22<320,\"Yellow\",IF(P22<480,\"Orange\",IF(P22<630,\"Brown\",\"Red\")))))","v":"Red"},{"$f":"IF($R$20=\"RHD\",IF(L22<160,\"Green\",IF(L22<320,\"Yellow\",IF(L22<480,\"Orange\",IF(L22<630,\"Brown\",\"Red\")))),IF(O22<160,\"Green\",IF(O22<320,\"Yellow\",IF(O22<480,\"Orange\",IF(O22<630,\"Brown\",\"Red\")))))","v":"Red"},{"$f":"IF($R$20=\"RHD\",IF(M22<160,\"Green\",IF(M22<320,\"Yellow\",IF(M22<480,\"Orange\",IF(M22<630,\"Brown\",\"Red\")))),IF(N22<160,\"Green\",IF(N22<320,\"Yellow\",IF(N22<480,\"Orange\",IF(N22<630,\"Brown\",\"Red\")))))","v":"Red"},{"$f":"IF($R$20=\"RHD\",IF(N22<160,\"Green\",IF(N22<320,\"Yellow\",IF(N22<480,\"Orange\",IF(N22<630,\"Brown\",\"Red\")))),IF(M22<160,\"Green\",IF(M22<320,\"Yellow\",IF(M22<480,\"Orange\",IF(M22<630,\"Brown\",\"Red\")))))","v":"Red"},{"$f":"IF($R$20=\"RHD\",IF(O22<160,\"Green\",IF(O22<320,\"Yellow\",IF(O22<480,\"Orange\",IF(O22<630,\"Brown\",\"Red\")))),IF(L22<160,\"Green\",IF(L22<320,\"Yellow\",IF(L22<480,\"Orange\",IF(L22<630,\"Brown\",\"Red\")))))","v":"Red"},{"$f":"IF($R$20=\"RHD\",IF(P22<160,\"Green\",IF(P22<320,\"Yellow\",IF(P22<480,\"Orange\",IF(P22<630,\"Brown\",\"Red\")))),IF(K22<160,\"Green\",IF(K22<320,\"Yellow\",IF(K22<480,\"Orange\",IF(K22<630,\"Brown\",\"Red\")))))","v":"Red"}]
[null,"Neck Colour",null,{"$f":"IF('AOP Frontal MPDB'!E32=4,\"Green\",IF('AOP Frontal MPDB'!E32>=2.67,\"Yellow\",IF('AOP Frontal MPDB'!E32>=1.33,\"Orange\",IF('AOP Frontal MPDB'!E32>0,\"Brown\",\"Red\"))))","v":"Red"},null,{"$f":"IF('AOP Frontal MPDB'!G32=4,\"Green\",IF('AOP Frontal MPDB'!G32>=2.67,\"Yellow\",IF('AOP Frontal MPDB'!G32>=1.33,\"Orange\",IF('AOP Frontal MPDB'!G32>0,\"Brown\",\"Red\"))))","v":"Red"},null,null,"Row_6",3,{"$f":"IF(J20=\"Enter X-deformation\",999,AVERAGEIFS('AOP Frontal MPDB'!$N$148:$N$1547,'AOP Frontal MPDB'!$L$148:$L$1547,\">=\"&'AOP Frontal MPDB'!$M$143,'AOP Frontal MPDB'!$L$148:$L$1547,\"<\"&'AOP Frontal MPDB'!$M$143+SUM($J$21:K$21),'AOP Frontal MPDB'!$K$148:$K$1547,\"<=\"&'AOP Frontal MPDB'!$I$144-SUM($J$21:$J22),'AOP Frontal MPDB'!$K$148:$K$1547,\">\"&'AOP Frontal MPDB'!$I$144-SUM($J$21:$J23)))","v":999},{"$f":"IF(J20=\"Enter X-deformation\",999,AVERAGEIFS('AOP Frontal MPDB'!$N$148:$N$1547,'AOP Frontal MPDB'!$L$148:$L$1547,\">=\"&'AOP Frontal MPDB'!$M$143+SUM($J$21:K$21),'AOP Frontal MPDB'!$L$148:$L$1547,\"<\"&'AOP Frontal MPDB'!$M$143+SUM($J$21:L$21),'AOP Frontal MPDB'!$K$148:$K$1547,\"<=\"&'AOP Frontal MPDB'!$I$144-SUM($J$21:$J22),'AOP Frontal MPDB'!$K$148:$K$1547,\">\"&'AOP Frontal MPDB'!$I$144-SUM($J$21:$J23)))","v":999},{"$f":"IF($J$20=\"Enter X-deformation\",999,AVERAGEIFS('AOP Frontal MPDB'!$N$148:$N$1547,'AOP Frontal MPDB'!$L$148:$L$1547,\">=\"&'AOP Frontal MPDB'!$M$143+SUM($J$21:L$21),'AOP Frontal MPDB'!$L$148:$L$1547,\"<\"&'AOP Frontal MPDB'!$M$143+SUM($J$21:M$21),'AOP Frontal MPDB'!$K$148:$K$1547,\"<=\"&'AOP Frontal MPDB'!$I$144-SUM($J$21:$J22),'AOP Frontal MPDB'!$K$148:$K$1547,\">\"&'AOP Frontal MPDB'!$I$144-SUM($J$21:$J23)))","v":999},{"$f":"IF($J$20=\"Enter X-deformation\",999,AVERAGEIFS('AOP Frontal MPDB'!$N$148:$N$1547,'AOP Frontal MPDB'!$L$148:$L$1547,\">=\"&'AOP Frontal MPDB'!$M$143+SUM($J$21:M$21),'AOP Frontal MPDB'!$L$148:$L$1547,\"<\"&'AOP Frontal MPDB'!$M$143+SUM($J$21:N$21),'AOP Frontal MPDB'!$K$148:$K$1547,\"<=\"&'AOP Frontal MPDB'!$I$144-SUM($J$21:$J22),'AOP Frontal MPDB'!$K$148:$K$1547,\">\"&'AOP Frontal MPDB'!$I$144-SUM($J$21:$J23)))","v":999},{"$f":"IF($J$20=\"Enter X-deformation\",999,AVERAGEIFS('AOP Frontal MPDB'!$N$148:$N$1547,'AOP Frontal MPDB'!$L$148:$L$1547,\">=\"&'AOP Frontal MPDB'!$M$143+SUM($J$21:N$21),'AOP Frontal MPDB'!$L$148:$L$1547,\"<\"&'AOP Frontal MPDB'!$M$143+SUM($J$21:O$21),'AOP Frontal MPDB'!$K$148:$K$1547,\"<=\"&'AOP Frontal MPDB'!$I$144-SUM($J$21:$J22),'AOP Frontal MPDB'!$K$148:$K$1547,\">\"&'AOP Frontal MPDB'!$I$144-SUM($J$21:$J23)))","v":999},{"$f":"IF($J$20=\"Enter X-deformation\",999,AVERAGEIFS('AOP Frontal MPDB'!$N$148:$N$1547,'AOP Frontal MPDB'!$L$148:$L$1547,\">=\"&'AOP Frontal MPDB'!$M$143+SUM($J$21:O$21),'AOP Frontal MPDB'!$L$148:$L$1547,\"<\"&'AOP Frontal MPDB'!$M$143+SUM($J$21:P$21),'AOP Frontal MPDB'!$K$148:$K$1547,\"<=\"&'AOP Frontal MPDB'!$I$144-SUM($J$21:$J22),'AOP Frontal MPDB'!$K$148:$K$1547,\">\"&'AOP Frontal MPDB'!$I$144-SUM($J$21:$J23)))","v":999},null,"Row_6","Red","Red","Red","Red","Red","Red"]
[null,"Chest Colour",null,{"$f":"IF('AOP Frontal MPDB'!E51=4,\"Green\",IF('AOP Frontal MPDB'!E51>=2.67,\"Yellow\",IF('AOP Frontal MPDB'!E51>=1.33,\"Orange\",IF('AOP Frontal MPDB'!E51>0,\"Brown\",\"Red\"))))","v":"Red"},null,{"$f":"IF('AOP Frontal MPDB'!G51=4,\"Green\",IF('AOP Frontal MPDB'!G51>=2.67,\"Yellow\",IF('AOP Frontal MPDB'!G51>=1.33,\"Orange\",IF('AOP Frontal MPDB'!G51>0,\"Brown\",\"Red\"))))","v":"Red"},null,null,"Row_5",3,{"$f":"IF(J20=\"Enter X-deformation\",999,AVERAGEIFS('AOP Frontal MPDB'!$N$148:$N$1547,'AOP Frontal MPDB'!$L$148:$L$1547,\">=\"&'AOP Frontal MPDB'!$M$143,'AOP Frontal MPDB'!$L$148:$L$1547,\"<\"&'AOP Frontal MPDB'!$M$143+SUM($J$21:K$21),'AOP Frontal MPDB'!$K$148:$K$1547,\"<=\"&'AOP Frontal MPDB'!$I$144-SUM($J$21:$J23),'AOP Frontal MPDB'!$K$148:$K$1547,\">\"&'AOP Frontal MPDB'!$I$144-SUM($J$21:$J24)))","v":999},{"$f":"IF(J20=\"Enter X-deformation\",999,AVERAGEIFS('AOP Frontal MPDB'!$N$148:$N$1547,'AOP Frontal MPDB'!$L$148:$L$1547,\">=\"&'AOP Frontal MPDB'!$M$143+SUM($J$21:K$21),'AOP Frontal MPDB'!$L$148:$L$1547,\"<\"&'AOP Frontal MPDB'!$M$143+SUM($J$21:L$21),'AOP Frontal MPDB'!$K$148:$K$1547,\"<=\"&'AOP Frontal MPDB'!$I$144-SUM($J$21:$J23),'AOP Frontal MPDB'!$K$148:$K$1547,\">\"&'AOP Frontal MPDB'!$I$144-SUM($J$21:$J24)))","v":999},{"$f":"IF($J$20=\"Enter X-deformation\",999,AVERAGEIFS('AOP Frontal MPDB'!$N$148:$N$1547,'AOP Frontal MPDB'!$L$148:$L$1547,\">=\"&'AOP Frontal MPDB'!$M$143+SUM($J$21:L$21),'AOP Frontal MPDB'!$L$148:$L$1547,\"<\"&'AOP Frontal MPDB'!$M$143+SUM($J$21:M$21),'AOP Frontal MPDB'!$K$148:$K$1547,\"<=\"&'AOP Frontal MPDB'!$I$144-SUM($J$21:$J23),'AOP Frontal MPDB'!$K$148:$K$1547,\">\"&'AOP Frontal MPDB'!$I$144-SUM($J$21:$J24)))","v":999},{"$f":"IF($J$20=\"Enter X-deformation\",999,AVERAGEIFS('AOP Frontal MPDB'!$N$148:$N$1547,'AOP Frontal MPDB'!$L$148:$L$1547,\">=\"&'AOP Frontal MPDB'!$M$143+SUM($J$21:M$21),'AOP Frontal MPDB'!$L$148:$L$1547,\"<\"&'AOP Frontal MPDB'!$M$143+SUM($J$21:N$21),'AOP Frontal MPDB'!$K$148:$K$1547,\"<=\"&'AOP Frontal MPDB'!$I$144-SUM($J$21:$J23),'AOP Frontal MPDB'!$K$148:$K$1547,\">\"&'AOP Frontal MPDB'!$I$144-SUM($J$21:$J24)))","v":999},{"$f":"IF($J$20=\"Enter X-deformation\",999,AVERAGEIFS('AOP Frontal MPDB'!$N$148:$N$1547,'AOP Frontal MPDB'!$L$148:$L$1547,\">=\"&'AOP Frontal MPDB'!$M$143+SUM($J$21:N$21),'AOP Frontal MPDB'!$L$148:$L$1547,\"<\"&'AOP Frontal MPDB'!$M$143+SUM($J$21:O$21),'AOP Frontal MPDB'!$K$148:$K$1547,\"<=\"&'AOP Frontal MPDB'!$I$144-SUM($J$21:$J23),'AOP Frontal MPDB'!$K$148:$K$1547,\">\"&'AOP Frontal MPDB'!$I$144-SUM($J$21:$J24)))","v":999},{"$f":"IF($J$20=\"Enter X-deformation\",999,AVERAGEIFS('AOP Frontal MPDB'!$N$148:$N$1547,'AOP Frontal MPDB'!$L$148:$L$1547,\">=\"&'AOP Frontal MPDB'!$M$143+SUM($J$21:O$21),'AOP Frontal MPDB'!$L$148:$L$1547,\"<\"&'AOP Frontal MPDB'!$M$143+SUM($J$21:P$21),'AOP Frontal MPDB'!$K$148:$K$1547,\"<=\"&'AOP Frontal MPDB'!$I$144-SUM($J$21:$J23),'AOP Frontal MPDB'!$K$148:$K$1547,\">\"&'AOP Frontal MPDB'!$I$144-SUM($J$21:$J24)))","v":999},null,"Row_5","Red","Red","Red","Red","Red","Red"]
[null,"Abdomen",null,{"$f":"IF('AOP Frontal MPDB'!E55=4,\"Green\",IF('AOP Frontal MPDB'!E55>=2.67,\"Yellow\",IF('AOP Frontal MPDB'!E55>=1.33,\"Orange\",IF('AOP Frontal MPDB'!E55>0,\"Brown\",\"Red\"))))","v":"Red"},null,null,null,null,"Row_4",2,{"$f":"IF(J20=\"Enter X-deformation\",999,AVERAGEIFS('AOP Frontal MPDB'!$N$148:$N$1547,'AOP Frontal MPDB'!$L$148:$L$1547,\">=\"&'AOP Frontal MPDB'!$M$143,'AOP Frontal MPDB'!$L$148:$L$1547,\"<\"&'AOP Frontal MPDB'!$M$143+SUM($J$21:K$21),'AOP Frontal MPDB'!$K$148:$K$1547,\"<=\"&'AOP Frontal MPDB'!$I$144-SUM($J$21:$J24),'AOP Frontal MPDB'!$K$148:$K$1547,\">\"&'AOP Frontal MPDB'!$I$144-SUM($J$21:$J25)))","v":999},{"$f":"IF(J20=\"Enter X-deformation\",999,AVERAGEIFS('AOP Frontal MPDB'!$N$148:$N$1547,'AOP Frontal MPDB'!$L$148:$L$1547,\">=\"&'AOP Frontal MPDB'!$M$143+SUM($J$21:K$21),'AOP Frontal MPDB'!$L$148:$L$1547,\"<\"&'AOP Frontal MPDB'!$M$143+SUM($J$21:L$21),'AOP Frontal MPDB'!$K$148:$K$1547,\"<=\"&'AOP Frontal MPDB'!$I$144-SUM($J$21:$J24),'AOP Frontal MPDB'!$K$148:$K$1547,\">\"&'AOP Frontal MPDB'!$I$144-SUM($J$21:$J25)))","v":999},{"$f":"IF($J$20=\"Enter X-deformation\",999,AVERAGEIFS('AOP Frontal MPDB'!$N$148:$N$1547,'AOP Frontal MPDB'!$L$148:$L$1547,\">=\"&'AOP Frontal MPDB'!$M$143+SUM($J$21:L$21),'AOP Frontal MPDB'!$L$148:$L$1547,\"<\"&'AOP Frontal MPDB'!$M$143+SUM($J$21:M$21),'AOP Frontal MPDB'!$K$148:$K$1547,\"<=\"&'AOP Frontal MPDB'!$I$144-SUM($J$21:$J24),'AOP Frontal MPDB'!$K$148:$K$1547,\">\"&'AOP Frontal MPDB'!$I$144-SUM($J$21:$J25)))","v":999},{"$f":"IF($J$20=\"Enter X-deformation\",999,AVERAGEIFS('AOP Frontal MPDB'!$N$148:$N$1547,'AOP Frontal MPDB'!$L$148:$L$1547,\">=\"&'AOP Frontal MPDB'!$M$143+SUM($J$21:M$21),'AOP Frontal MPDB'!$L$148:$L$1547,\"<\"&'AOP Frontal MPDB'!$M$143+SUM($J$21:N$21),'AOP Frontal MPDB'!$K$148:$K$1547,\"<=\"&'AOP Frontal MPDB'!$I$144-SUM($J$21:$J24),'AOP Frontal MPDB'!$K$148:$K$1547,\">\"&'AOP Frontal MPDB'!$I$144-SUM($J$21:$J25)))","v":999},{"$f":"IF($J$20=\"Enter X-deformation\",999,AVERAGEIFS('AOP Frontal MPDB'!$N$148:$N$1547,'AOP Frontal MPDB'!$L$148:$L$1547,\">=\"&'AOP Frontal MPDB'!$M$143+SUM($J$21:N$21),'AOP Frontal MPDB'!$L$148:$L$1547,\"<\"&'AOP Frontal MPDB'!$M$143+SUM($J$21:O$21),'AOP Frontal MPDB'!$K$148:$K$1547,\"<=\"&'AOP Frontal MPDB'!$I$144-SUM($J$21:$J24),'AOP Frontal MPDB'!$K$148:$K$1547,\">\"&'AOP Frontal MPDB'!$I$144-SUM($J$21:$J25)))","v":999},{"$f":"IF($J$20=\"Enter X-deformation\",999,AVERAGEIFS('AOP Frontal MPDB'!$N$148:$N$1547,'AOP Frontal MPDB'!$L$148:$L$1547,\">=\"&'AOP Frontal MPDB'!$M$143+SUM($J$21:O$21),'AOP Frontal MPDB'!$L$148:$L$1547,\"<\"&'AOP Frontal MPDB'!$M$143+SUM($J$21:P$21),'AOP Frontal MPDB'!$K$148:$K$1547,\"<=\"&'AOP Frontal MPDB'!$I$144-SUM($J$21:$J24),'AOP Frontal MPDB'!$K$148:$K$1547,\">\"&'AOP Frontal MPDB'!$I$144-SUM($J$21:$J25)))","v":999},null,"Row_4","Red","Red","Red","Red","Red","Red"]
[null,"Pelvis",null,{"$f":"IF('AOP Frontal MPDB'!E77=4,\"Green\",IF('AOP Frontal MPDB'!E77>=2.67,\"Yellow\",IF('AOP Frontal MPDB'!E77>=1.33,\"Orange\",IF('AOP Frontal MPDB'!E77>0,\"Brown\",\"Red\"))))","v":"Red"},null,null,null,null,"Row_3",3,{"$f":"IF(J20=\"Enter X-deformation\",999,AVERAGEIFS('AOP Frontal MPDB'!$N$148:$N$1547,'AOP Frontal MPDB'!$L$148:$L$1547,\">=\"&'AOP Frontal MPDB'!$M$143,'AOP Frontal MPDB'!$L$148:$L$1547,\"<\"&'AOP Frontal MPDB'!$M$143+SUM($J$21:K$21),'AOP Frontal MPDB'!$K$148:$K$1547,\"<=\"&'AOP Frontal MPDB'!$I$144-SUM($J$21:$J25),'AOP Frontal MPDB'!$K$148:$K$1547,\">\"&'AOP Frontal MPDB'!$I$144-SUM($J$21:$J26)))","v":999},{"$f":"IF(J20=\"Enter X-deformation\",999,AVERAGEIFS('AOP Frontal MPDB'!$N$148:$N$1547,'AOP Frontal MPDB'!$L$148:$L$1547,\">=\"&'AOP Frontal MPDB'!$M$143+SUM($J$21:K$21),'AOP Frontal MPDB'!$L$148:$L$1547,\"<\"&'AOP Frontal MPDB'!$M$143+SUM($J$21:L$21),'AOP Frontal MPDB'!$K$148:$K$1547,\"<=\"&'AOP Frontal MPDB'!$I$144-SUM($J$21:$J25),'AOP Frontal MPDB'!$K$148:$K$1547,\">\"&'AOP Frontal MPDB'!$I$144-SUM($J$21:$J26)))","v":999},{"$f":"IF($J$20=\"Enter X-deformation\",999,AVERAGEIFS('AOP Frontal MPDB'!$N$148:$N$1547,'AOP Frontal MPDB'!$L$148:$L$1547,\">=\"&'AOP Frontal MPDB'!$M$143+SUM($J$21:L$21),'AOP Frontal MPDB'!$L$148:$L$1547,\"<\"&'AOP Frontal MPDB'!$M$143+SUM($J$21:M$21),'AOP Frontal MPDB'!$K$148:$K$1547,\"<=\"&'AOP Frontal MPDB'!$I$144-SUM($J$21:$J25),'AOP Frontal MPDB'!$K$148:$K$1547,\">\"&'AOP Frontal MPDB'!$I$144-SUM($J$21:$J26)))","v":999},{"$f":"IF($J$20=\"Enter X-deformation\",999,AVERAGEIFS('AOP Frontal MPDB'!$N$148:$N$1547,'AOP Frontal MPDB'!$L$148:$L$1547,\">=\"&'AOP Frontal MPDB'!$M$143+SUM($J$21:M$21),'AOP Frontal MPDB'!$L$148:$L$1547,\"<\"&'AOP Frontal MPDB'!$M$143+SUM($J$21:N$21),'AOP Frontal MPDB'!$K$148:$K$1547,\"<=\"&'AOP Frontal MPDB'!$I$144-SUM($J$21:$J25),'AOP Frontal MPDB'!$K$148:$K$1547,\">\"&'AOP Frontal MPDB'!$I$144-SUM($J$21:$J26)))","v":999},{"$f":"IF($J$20=\"Enter X-deformation\",999,AVERAGEIFS('AOP Frontal MPDB'!$N$148:$N$1547,'AOP Frontal MPDB'!$L$148:$L$1547,\">=\"&'AOP Frontal MPDB'!$M$143+SUM($J$21:N$21),'AOP Frontal MPDB'!$L$148:$L$1547,\"<\"&'AOP Frontal MPDB'!$M$143+SUM($J$21:O$21),'AOP Frontal MPDB'!$K$148:$K$1547,\"<=\"&'AOP Frontal MPDB'!$I$144-SUM($J$21:$J25),'AOP Frontal MPDB'!$K$148:$K$1547,\">\"&'AOP Frontal MPDB'!$I$144-SUM($J$21:$J26)))","v":999},{"$f":"IF($J$20=\"Enter X-deformation\",999,AVERAGEIFS('AOP Frontal MPDB'!$N$148:$N$1547,'AOP Frontal MPDB'!$L$148:$L$1547,\">=\"&'AOP Frontal MPDB'!$M$143+SUM($J$21:O$21),'AOP Frontal MPDB'!$L$148:$L$1547,\"<\"&'AOP Frontal MPDB'!$M$143+SUM($J$21:P$21),'AOP Frontal MPDB'!$K$148:$K$1547,\"<=\"&'AOP Frontal MPDB'!$I$144-SUM($J$21:$J25),'AOP Frontal MPDB'!$K$148:$K$1547,\">\"&'AOP Frontal MPDB'!$I$144-SUM($J$21:$J26)))","v":999},null,"Row_3","Red","Red","Red","Red","Red","Red"]
[null,"KFP - left",null,{"$f":"IF('AOP Frontal MPDB'!E66=4,\"Green\",IF('AOP Frontal MPDB'!E66>=2.67,\"Yellow\",IF('AOP Frontal MPDB'!E66>=1.33,\"Orange\",IF('AOP Frontal MPDB'!E66>0,\"Brown\",\"Red\"))))","v":"Red"},null,{"$f":"IF('AOP Frontal MPDB'!G66=4,\"Green\",IF('AOP Frontal MPDB'!G66>=2.67,\"Yellow\",IF('AOP Frontal MPDB'!G66>=1.33,\"Orange\",IF('AOP Frontal MPDB'!G66>0,\"Brown\",\"Red\"))))","v":"Red"},null,null,"Row_2",3,{"$f":"IF(J20=\"Enter X-deformation\",999,AVERAGEIFS('AOP Frontal MPDB'!$N$148:$N$1547,'AOP Frontal MPDB'!$L$148:$L$1547,\">=\"&'AOP Frontal MPDB'!$M$143,'AOP Frontal MPDB'!$L$148:$L$1547,\"<\"&'AOP Frontal MPDB'!$M$143+SUM($J$21:K$21),'AOP Frontal MPDB'!$K$148:$K$1547,\"<=\"&'AOP Frontal MPDB'!$I$144-SUM($J$21:$J26),'AOP Frontal MPDB'!$K$148:$K$1547,\">\"&'AOP Frontal MPDB'!$I$144-SUM($J$21:$J27)))","v":999},{"$f":"IF(J20=\"Enter X-deformation\",999,AVERAGEIFS('AOP Frontal MPDB'!$N$148:$N$1547,'AOP Frontal MPDB'!$L$148:$L$1547,\">=\"&'AOP Frontal MPDB'!$M$143+SUM($J$21:K$21),'AOP Frontal MPDB'!$L$148:$L$1547,\"<\"&'AOP Frontal MPDB'!$M$143+SUM($J$21:L$21),'AOP Frontal MPDB'!$K$148:$K$1547,\"<=\"&'AOP Frontal MPDB'!$I$144-SUM($J$21:$J26),'AOP Frontal MPDB'!$K$148:$K$1547,\">\"&'AOP Frontal MPDB'!$I$144-SUM($J$21:$J27)))","v":999},{"$f":"IF($J$20=\"Enter X-deformation\",999,AVERAGEIFS('AOP Frontal MPDB'!$N$148:$N$1547,'AOP Frontal MPDB'!$L$148:$L$1547,\">=\"&'AOP Frontal MPDB'!$M$143+SUM($J$21:L$21),'AOP Frontal MPDB'!$L$148:$L$1547,\"<\"&'AOP Frontal MPDB'!$M$143+SUM($J$21:M$21),'AOP Frontal MPDB'!$K$148:$K$1547,\"<=\"&'AOP Frontal MPDB'!$I$144-SUM($J$21:$J26),'AOP Frontal MPDB'!$K$148:$K$1547,\">\"&'AOP Frontal MPDB'!$I$144-SUM($J$21:$J27)))","v":999},{"$f":"IF($J$20=\"Enter X-deformation\",999,AVERAGEIFS('AOP Frontal MPDB'!$N$148:$N$1547,'AOP Frontal MPDB'!$L$148:$L$1547,\">=\"&'AOP Frontal MPDB'!$M$143+SUM($J$21:M$21),'AOP Frontal MPDB'!$L$148:$L$1547,\"<\"&'AOP Frontal MPDB'!$M$143+SUM($J$21:N$21),'AOP Frontal MPDB'!$K$148:$K$1547,\"<=\"&'AOP Frontal MPDB'!$I$144-SUM($J$21:$J26),'AOP Frontal MPDB'!$K$148:$K$1547,\">\"&'AOP Frontal MPDB'!$I$144-SUM($J$21:$J27)))","v":999},{"$f":"IF($J$20=\"Enter X-deformation\",999,AVERAGEIFS('AOP Frontal MPDB'!$N$148:$N$1547,'AOP Frontal MPDB'!$L$148:$L$1547,\">=\"&'AOP Frontal MPDB'!$M$143+SUM($J$21:N$21),'AOP Frontal MPDB'!$L$148:$L$1547,\"<\"&'AOP Frontal MPDB'!$M$143+SUM($J$21:O$21),'AOP Frontal MPDB'!$K$148:$K$1547,\"<=\"&'AOP Frontal MPDB'!$I$144-SUM($J$21:$J26),'AOP Frontal MPDB'!$K$148:$K$1547,\">\"&'AOP Frontal MPDB'!$I$144-SUM($J$21:$J27)))","v":999},{"$f":"IF($J$20=\"Enter X-deformation\",999,AVERAGEIFS('AOP Frontal MPDB'!$N$148:$N$1547,'AOP Frontal MPDB'!$L$148:$L$1547,\">=\"&'AOP Frontal MPDB'!$M$143+SUM($J$21:O$21),'AOP Frontal MPDB'!$L$148:$L$1547,\"<\"&'AOP Frontal MPDB'!$M$143+SUM($J$21:P$21),'AOP Frontal MPDB'!$K$148:$K$1547,\"<=\"&'AOP Frontal MPDB'!$I$144-SUM($J$21:$J26),'AOP Frontal MPDB'!$K$148:$K$1547,\">\"&'AOP Frontal MPDB'!$I$144-SUM($J$21:$J27)))","v":999},null,"Row_2","Red","Red","Red","Red","Red","Red"]
[null,"KFP - right",{"$f":"IF(ABS('AOP Frontal MPDB'!D127)<2,\"benign\",IF(ABS('AOP Frontal MPDB'!D127)<4,\"moderately benign\",IF(ABS('AOP Frontal MPDB'!D127)<6,\"somewhat aggressive\",IF(ABS('AOP Frontal MPDB'!D127)<=8,\"aggressive\",\"\"))))","v":"benign"},{"$f":"IF('AOP Frontal MPDB'!E73=4,\"Green\",IF('AOP Frontal MPDB'!E73>=2.67,\"Yellow\",IF('AOP Frontal MPDB'!E73>=1.33,\"Orange\",IF('AOP Frontal MPDB'!E73>0,\"Brown\",\"Red\"))))","v":"Red"},null,{"$f":"IF('AOP Frontal MPDB'!G73=4,\"Green\",IF('AOP Frontal MPDB'!G73>=2.67,\"Yellow\",IF('AOP Frontal MPDB'!G73>=1.33,\"Orange\",IF('AOP Frontal MPDB'!G73>0,\"Brown\",\"Red\"))))","v":"Red"},null,null,"Row_1",3,{"$f":"IF(J20=\"Enter X-deformation\",999,AVERAGEIFS('AOP Frontal MPDB'!$N$148:$N$1547,'AOP Frontal MPDB'!$L$148:$L$1547,\">=\"&'AOP Frontal MPDB'!$M$143,'AOP Frontal MPDB'!$L$148:$L$1547,\"<\"&'AOP Frontal MPDB'!$M$143+SUM($J$21:K$21),'AOP Frontal MPDB'!$K$148:$K$1547,\"<=\"&'AOP Frontal MPDB'!$I$144-SUM($J$21:$J27),'AOP Frontal MPDB'!$K$148:$K$1547,\">\"&'AOP Frontal MPDB'!$I$144-SUM($J$21:$J28)))","v":999},{"$f":"IF(J20=\"Enter X-deformation\",999,AVERAGEIFS('AOP Frontal MPDB'!$N$148:$N$1547,'AOP Frontal MPDB'!$L$148:$L$1547,\">=\"&'AOP Frontal MPDB'!$M$143+SUM($J$21:K$21),'AOP Frontal MPDB'!$L$148:$L$1547,\"<\"&'AOP Frontal MPDB'!$M$143+SUM($J$21:L$21),'AOP Frontal MPDB'!$K$148:$K$1547,\"<=\"&'AOP Frontal MPDB'!$I$144-SUM($J$21:$J27),'AOP Frontal MPDB'!$K$148:$K$1547,\">\"&'AOP Frontal MPDB'!$I$144-SUM($J$21:$J28)))","v":999},{"$f":"IF($J$20=\"Enter X-deformation\",999,AVERAGEIFS('AOP Frontal MPDB'!$N$148:$N$1547,'AOP Frontal MPDB'!$L$148:$L$1547,\">=\"&'AOP Frontal MPDB'!$M$143+SUM($J$21:L$21),'AOP Frontal MPDB'!$L$148:$L$1547,\"<\"&'AOP Frontal MPDB'!$M$143+SUM($J$21:M$21),'AOP Frontal MPDB'!$K$148:$K$1547,\"<=\"&'AOP Frontal MPDB'!$I$144-SUM($J$21:$J27),'AOP Frontal MPDB'!$K$148:$K$1547,\">\"&'AOP Frontal MPDB'!$I$144-SUM($J$21:$J28)))","v":999},{"$f":"IF($J$20=\"Enter X-deformation\",999,AVERAGEIFS('AOP Frontal MPDB'!$N$148:$N$1547,'AOP Frontal MPDB'!$L$148:$L$1547,\">=\"&'AOP Frontal MPDB'!$M$143+SUM($J$21:M$21),'AOP Frontal MPDB'!$L$148:$L$1547,\"<\"&'AOP Frontal MPDB'!$M$143+SUM($J$21:N$21),'AOP Frontal MPDB'!$K$148:$K$1547,\"<=\"&'AOP Frontal MPDB'!$I$144-SUM($J$21:$J27),'AOP Frontal MPDB'!$K$148:$K$1547,\">\"&'AOP Frontal MPDB'!$I$144-SUM($J$21:$J28)))","v":999},{"$f":"IF($J$20=\"Enter X-deformation\",999,AVERAGEIFS('AOP Frontal MPDB'!$N$148:$N$1547,'AOP Frontal MPDB'!$L$148:$L$1547,\">=\"&'AOP Frontal MPDB'!$M$143+SUM($J$21:N$21),'AOP Frontal MPDB'!$L$148:$L$1547,\"<\"&'AOP Frontal MPDB'!$M$143+SUM($J$21:O$21),'AOP Frontal MPDB'!$K$148:$K$1547,\"<=\"&'AOP Frontal MPDB'!$I$144-SUM($J$21:$J27),'AOP Frontal MPDB'!$K$148:$K$1547,\">\"&'AOP Frontal MPDB'!$I$144-SUM($J$21:$J28)))","v":999},{"$f":"IF($J$20=\"Enter X-deformation\",999,AVERAGEIFS('AOP Frontal MPDB'!$N$148:$N$1547,'AOP Frontal MPDB'!$L$148:$L$1547,\">=\"&'AOP Frontal MPDB'!$M$143+SUM($J$21:O$21),'AOP Frontal MPDB'!$L$148:$L$1547,\"<\"&'AOP Frontal MPDB'!$M$143+SUM($J$21:P$21),'AOP Frontal MPDB'!$K$148:$K$1547,\"<=\"&'AOP Frontal MPDB'!$I$144-SUM($J$21:$J27),'AOP Frontal MPDB'!$K$148:$K$1547,\">\"&'AOP Frontal MPDB'!$I$144-SUM($J$21:$J28)))","v":999},null,"Row_1","Red","Red","Red","Red","Red","Red"]
[null,"Lower Leg - left",null,{"$f":"IF('AOP Frontal MPDB'!E89=4,\"Green\",IF('AOP Frontal MPDB'!E89>=2.67,\"Yellow\",IF('AOP Frontal MPDB'!E89>=1.33,\"Orange\",IF('AOP Frontal MPDB'!E89>0,\"Brown\",\"Red\"))))","v":"Red"},null,{"$f":"IF('AOP Frontal MPDB'!G89=4,\"Green\",IF('AOP Frontal MPDB'!G89>=2.67,\"Yellow\",IF('AOP Frontal MPDB'!G89>=1.33,\"Orange\",IF('AOP Frontal MPDB'!G89>0,\"Brown\",\"Red\"))))","v":"Red"}]
[null,"Lower Leg - right",null,{"$f":"IF('AOP Frontal MPDB'!E98=4,\"Green\",IF('AOP Frontal MPDB'!E98>=2.67,\"Yellow\",IF('AOP Frontal MPDB'!E98>=1.33,\"Orange\",IF('AOP Frontal MPDB'!E98>0,\"Brown\",\"Red\"))))","v":"Red"},null,{"$f":"IF('AOP Frontal MPDB'!G98=4,\"Green\",IF('AOP Frontal MPDB'!G98>=2.67,\"Yellow\",IF('AOP Frontal MPDB'!G98>=1.33,\"Orange\",IF('AOP Frontal MPDB'!G98>0,\"Brown\",\"Red\"))))","v":"Red"}]
[null,"Foot & Ankle",null,{"$f":"IF('AOP Frontal MPDB'!E107=4,\"Green\",IF('AOP Frontal MPDB'!E107>=2.67,\"Yellow\",IF('AOP Frontal MPDB'!E107>=1.33,\"Orange\",IF('AOP Frontal MPDB'!E107>0,\"Brown\",\"Red\"))))","v":"Red"}]
[null,"Rounded Total",{"$f":"ROUND('AOP Frontal MPDB'!D129,1)","v":0}]
[null,"Max Points",8]
[]
[null,"FW"]
[null,"Head colour",{"$f":"IF(OR(D36:D41=\"Red\",D36:D41=\"Brown\",D36:D41=\"Orange\",F36:F41=\"Red\",F36:F41=\"Brown\",F36:F41=\"Orange\"),TRUE,FALSE)","v":true},{"$f":"IF('AOP Frontal FW'!D14=4,\"Green\",IF('AOP Frontal FW'!D14>=2.67,\"Yellow\",IF('AOP Frontal FW'!D14>=1.33,\"Orange\",IF('AOP Frontal FW'!D14>0,\"Brown\",\"Red\"))))","v":"Red"},null,{"$f":"IF('AOP Frontal FW'!H14=4,\"Green\",IF('AOP Frontal FW'!H14>=2.67,\"Yellow\",IF('AOP Frontal FW'!H14>=1.33,\"Orange\",IF('AOP Frontal FW'!H14>0,\"Brown\",\"Red\"))))","v":"Red"}]
[null,"Neck colour",{"$f":"IF(AND(D36:D41=\"Green\",F36:F41=\"Green\"),TRUE,FALSE)","v":false},{"$f":"IF('AOP Frontal FW'!D20=4,\"Green\",IF('AOP Frontal FW'!D20>=2.67,\"Yellow\",IF('AOP Frontal FW'!D20>=1.33,\"Orange\",IF('AOP Frontal FW'!D20>0,\"Brown\",\"Red\"))))","v":"Red"},null,{"$f":"IF('AOP Frontal FW'!H20=4,\"Green\",IF('AOP Frontal FW'!H20>=2.67,\"Yellow\",IF('AOP Frontal FW'!H20>=1.33,\"Orange\",IF('AOP Frontal FW'!H20>0,\"Brown\",\"Red\"))))","v":"Red"}]
[null,"Chest colour",null,{"$f":"IF('AOP Frontal FW'!D28=4,\"Green\",IF('AOP Frontal FW'!D28>=2.67,\"Yellow\",IF('AOP Frontal FW'!D28>=1.33,\"Orange\",IF('AOP Frontal FW'!D28>0,\"Brown\",\"Red\"))))","v":"Red"},null,{"$f":"IF('AOP Frontal FW'!H28=4,\"Green\",IF('AOP Frontal FW'!H28>=2.67,\"Yellow\",IF('AOP Frontal FW'!H28>=1.33,\"Orange\",IF('AOP Frontal FW'!H28>0,\"Brown\",\"Red\"))))","v":"Red"}]
[null,"KF - left",null,{"$f":"IF('AOP Frontal FW'!E34=4,\"Green\",IF('AOP Frontal FW'!E34>=2.67,\"Yellow\",IF('AOP Frontal FW'!E34>=1.33,\"Orange\",IF('AOP Frontal FW'!E34>0,\"Brown\",\"Red\"))))","v":"Red"},null,{"$f":"IF('AOP Frontal FW'!I34=4,\"Green\",IF('AOP Frontal FW'!I34>=2.67,\"Yellow\",IF('AOP Frontal FW'!I34>=1.33,\"Orange\",IF('AOP Frontal FW'!I34>0,\"Brown\",\"Red\"))))","v":"Red"}]
[null,"KF - right",null,{"$f":"IF('AOP Frontal FW'!E38=4,\"Green\",IF('AOP Frontal FW'!E38>=2.67,\"Yellow\",IF('AOP Frontal FW'!E38>=1.33,\"Orange\",IF('AOP Frontal FW'!E38>0,\"Brown\",\"Red\"))))","v":"Red"},null,{"$f":"IF('AOP Frontal FW'!I38=4,\"Green\",IF('AOP Frontal FW'!I38>=2.67,\"Yellow\",IF('AOP Frontal FW'!I38>=1.33,\"Orange\",IF('AOP Frontal FW'!I38>0,\"Brown\",\"Red\"))))","v":"Red"}]
[null,"Pelvis colour",null,{"$f":"IF('AOP Frontal FW'!E41=0,\"Green\",IF('AOP Frontal FW'!E41=-4,\"Red\"))","v":"Green"},null,{"$f":"IF('AOP Frontal FW'!I41=0,\"Green\",IF('AOP Frontal FW'!I41=-4,\"Red\"))","v":"Green"}]
[null,"Rounded Total",{"$f":"ROUND('AOP Frontal FW'!D63,1)","v":0}]
[null,"Max Points",8]
[]
[null,"AE-MDB"]
[null,"Head colour",null,{"$f":"IF('AOP Side MDB'!D11=4,\"Green\",IF('AOP Side MDB'!D11>=2.67,\"Yellow\",IF('AOP Side MDB'!D11>=1.33,\"Orange\",IF('AOP Side MDB'!D11>0,\"Brown\",\"Red\"))))","v":"Red"}]
[null,"Chest colour",null,{"$f":"IF('AOP Side MDB'!D27=4,\"Green\",IF('AOP Side MDB'!D27>=2.67,\"Yellow\",IF('AOP Side MDB'!D27>=1.33,\"Orange\",IF('AOP Side MDB'!D27>0,\"Brown\",\"Red\"))))","v":"Red"}]
[null,"Abdomen",null,{"$f":"IF('AOP Side MDB'!D38=4,\"Green\",IF('AOP Side MDB'!D38>=2.67,\"Yellow\",IF('AOP Side MDB'!D38>=1.33,\"Orange\",IF('AOP Side MDB'!D38>0,\"Brown\",\"Red\"))))","v":"Red"}]
[null,"Pelvis",null,{"$f":"IF('AOP Side MDB'!D43=4,\"Green\",IF('AOP Side MDB'!D43>=2.67,\"Yellow\",IF('AOP Side MDB'!D43>=1.33,\"Orange\",IF('AOP Side MDB'!D43>0,\"Brown\",\"Red\"))))","v":"Red"}]
[null,"Rounded Total",{"$f":"ROUND('AOP Side MDB'!D54,1)","v":0}]
[null,"Max Points",6]
[]
[null,"Side Pole"]
[null,"Head colour",null,{"$f":"IF('AOP Side Pole'!D12=4,\"Green\",IF('AOP Side Pole'!D12>=2.67,\"Yellow\",IF('AOP Side Pole'!D12>=1.33,\"Orange\",IF('AOP Side Pole'!D12>0,\"Brown\",\"Red\"))))","v":"Red"}]
[null,"Chest colour",null,{"$f":"IF('AOP Side Pole'!D27=4,\"Green\",IF('AOP Side Pole'!D27>=2.67,\"Yellow\",IF('AOP Side Pole'!D27>=1.33,\"Orange\",IF('AOP Side Pole'!D27>0,\"Brown\",\"Red\"))))","v":"Red"}]
[null,"Abdomen",null,{"$f":"IF('AOP Side Pole'!D38=4,\"Green\",IF('AOP Side Pole'!D38>=2.67,\"Yellow\",IF('AOP Side Pole'!D38>=1.33,\"Orange\",IF('AOP Side Pole'!D38>0,\"Brown\",\"Red\"))))","v":"Red"}]
[null,"Pelvis",null,{"$f":"IF('AOP Side Pole'!D43=4,\"Green\",IF('AOP Side Pole'!D43>=2.67,\"Yellow\",IF('AOP Side Pole'!D43>=1.33,\"Orange\",IF('AOP Side Pole'!D43>0,\"Brown\",\"Red\"))))","v":"Red"}]
[null,"Rounded Total",{"$f":"ROUND('AOP Side Pole'!D73,1)","v":0}]
[null,"Max Points",6]
[]
[null,"Far Side",null,"MDB",null,"Pole"]
[null,"Excursion Zone",{"$f":"IF(D67<F67,IF(AND('AOP Farside'!D10=\"Red\",'AOP Farside'!D11=\"Yes\"),\"Brown\",'AOP Farside'!D10),IF(AND('AOP Farside'!F10=\"Red\",'AOP Farside'!F11=\"Yes\"),\"Brown\",'AOP Farside'!F10))","v":0},null,null,null,null,null,"Red","poor."]
[null,"Head colour",{"$f":"IF($D$67<$F$67,D63,F63)","v":"Grey"},{"$f":"IF(OR('AOP Farside'!D16>700,'AOP Farside'!D17>80,'AOP Farside'!D10=\"Capping\"),\"Red\",\"Grey\")","v":"Grey"},null,{"$f":"IF(OR('AOP Farside'!F16>700,'AOP Farside'!F17>80,'AOP Farside'!F10=\"Capping\"),\"Red\",\"Grey\")","v":"Grey"},null,null,"Brown","weak."]
[null,"Neck colour",{"$f":"IF($D$67<$F$67,D64,F64)","v":"Grey"},{"$f":"\"Grey\"","v":"Grey"},null,{"$f":"\"Grey\"","v":"Grey"},null,null,"Orange","marginal."]
[null,"Chest & Abdomen",{"$f":"IF($D$67<$F$67,D65,F65)","v":"Grey"},{"$f":"IF(OR(MAX('AOP Farside'!D35:D37)>50,MAX('AOP Farside'!D40:D41)>65),\"Red\",\"Grey\")","v":"Grey"},null,{"$f":"IF(OR(MAX('AOP Farside'!F35:F37)>50,MAX('AOP Farside'!F40:F41)>65),\"Red\",\"Grey\")","v":"Grey"},null,null,"Yellow","adequate."]
[null,"Pelvis",{"$f":"IF($D$67<$F$67,D66,F66)","v":"Grey"},{"$f":"IF('AOP Farside'!D51=-4,\"Red\",\"Grey\")","v":"Grey"},null,{"$f":"IF('AOP Farside'!F51=-4,\"Red\",\"Grey\")","v":"Grey"},null,null,"Green","good."]
[null,"Rounded Test Score",null,{"$f":"ROUND('AOP Farside'!D60,1)","v":0},null,{"$f":"ROUND('AOP Farside'!F60,1)","v":0}]
[null,"Rounded Total",{"$f":"ROUND('AOP Farside'!D70,1)","v":0}]
[null,"Max Points",4]
[null,"O2O head colour",null,{"$f":"IF(AND('AOP Farside'!F63=\"\",'AOP Farside'!D63=\"\"),\"Grey\",IF('AOP Farside'!D68=0,\"Green\",IF('AOP Farside'!D68<0,\"Red\",\"VALUE!\")))","v":"Grey"}]
[null,"WHIPLASH"]
[null,"rounded total",{"$f":"ROUND('AOP Whiplash'!D76,1)","v":0}]
[null,"max points",4]
[null,"rounded static assessment",{"$f":"ROUND('AOP Whiplash'!D23,1)","v":0}]
[null,"dynamic rounded mid",{"$f":"ROUND('AOP Whiplash'!D40,1)","v":0}]
[null,"dynamic rounded high",{"$f":"ROUND('AOP Whiplash'!F40,1)","v":0}]
[null,null,null,"points"]
[null,"front_whiplash_colour",{"$f":"IF(D78>=2.25,\"Green\",IF(D78>1.125,\"Orange\",\"Red\"))","v":"Red"},{"$f":"'AOP Whiplash'!D73","v":0},{"$f":"IF(C78=\"Red\",\"poor\",IF(C78=\"Orange\",\"marginal\",IF(C78=\"Green\",\"good\",\"????\")))","v":"poor"}]
[null,"rear_whiplash_colour",{"$f":"IF(D79>=0.667,\"Green\",IF(D79>0.333,\"Orange\",\"Red\"))","v":"Red"},{"$f":"'AOP Whiplash'!D74","v":0},{"$f":"IF(C79=\"Red\",\"poor\",IF(C79=\"Orange\",\"marginal\",IF(C79=\"Green\",\"good\",\"????\")))","v":"poor"}]
[null,null,null,null,{"$f":"IF(E78=E79,\"also \",\"\")","v":"also "}]
[null,"RESCUE"]
[null,"rescue sheet comment",{"$f":"CONCATENATE(D82,E82)","v":"Not available in some countries, not ISO compliant"},{"$f":"IF(AND('AOP Rescue'!D7:D8=\"PASS\"),\"Available\",\"Not available in some countries\")","v":"Not available in some countries"},{"$f":"IF(AND('AOP Rescue'!H7:H8=\"PASS\"),\", ISO compliant\",\", not ISO compliant\")","v":", not ISO compliant"}]
[null,"advanced eCall comment",{"$f":"IF(OR('General Overview'!E35=\"Standard\",'General Overview'!E35=\"Optional meeting fitment\"),\"Available\",\"Not available\")","v":"Not available"}]
[null,"MCB comment",{"$f":"IF(OR('General Overview'!E36=\"Standard\",'General Overview'!E36=\"Optional meeting fitment\"),\"Available\",\"Not available\")","v":"Not available"}]
[null,"Submergence Comment",{"$f":"IF(AND('AOP Rescue'!D56:D57=\"Pass\"),\"Compliant\",IF(OR('AOP Rescue'!D56:D57=\"PASS\"),\"Partially Compliant\",\"Not Compliant\"))","v":"Partially Compliant"}]
[null,"Rescue rounded",{"$f":"ROUND('AOP Rescue'!D70,1)","v":0},{"$f":"IF(AND('AOP Rescue'!D7:D8=\"PASS\",'AOP Rescue'!H7:H8=\"PASS\"),\"GREEN\",IF(AND('AOP Rescue'!D7:D8=\"PASS\"),\"ORANGE\",\"RED\"))","v":"RED"}]
[null,"Extrication rounded",{"$f":"ROUND('AOP Rescue'!D71,1)","v":-1}]
[null,"Post_Crash rounded",{"$f":"ROUND('AOP Rescue'!D72,1)","v":0.5},{"$f":"IF('AOP Rescue'!D67=2,\"GREEN\",IF('AOP Rescue'!D67>0,\"ORANGE\",\"RED\"))","v":"ORANGE"}]
[null,"Rounded Total",{"$f":"ROUND('AOP Rescue'!D74,1)","v":-0.5}]
[null,"Max Points","4"]
["---->>","rescue_sheet_url_en"]
["---->>","rescue_sheet_url_de"]
["---->>","rescue_sheet_url_fr"]
["---->>","rescue_sheet_url_es"]
[]
[]
[null,"COP Dynamic",null,"Q6",null,"Q10"]
[null,"CRS Type",null,{"$f":"IF('COP Dynamic'!D9=\"Highback booster\",\"b\",\"a\")","v":"a"},null,"b"]
[null,"Frontal",{"$f":"'COP Dynamic'!D66+'COP Dynamic'!F66","v":0},{"$f":"ROUND(C99,1)","v":0}]
[null,"Head",null,{"$f":"IF('COP Dynamic'!E23=4,\"Green\",IF('COP Dynamic'!E23>=2.667,\"Yellow\",IF('COP Dynamic'!E23>=1.333,\"Orange\",IF('COP Dynamic'!E23>0,\"Brown\",\"Red\"))))","v":"Red"},null,{"$f":"IF('COP Dynamic'!G23=4,\"Green\",IF('COP Dynamic'!G23>=2.667,\"Yellow\",IF('COP Dynamic'!G23>=1.333,\"Orange\",IF('COP Dynamic'!G23>0,\"Brown\",\"Red\"))))","v":"Red"}]
[null,"Neck",null,{"$f":"IF('COP Dynamic'!E29=2,\"Green\",IF('COP Dynamic'!E29>=1.335,\"Yellow\",IF('COP Dynamic'!E29>=0.667,\"Orange\",IF('COP Dynamic'!E29>0,\"Brown\",\"Red\"))))","v":"Red"},null,{"$f":"IF('COP Dynamic'!G29=2,\"Green\",IF('COP Dynamic'!G29>=1.335,\"Yellow\",IF('COP Dynamic'!G29>=0.667,\"Orange\",IF('COP Dynamic'!G29>0,\"Brown\",\"Red\"))))","v":"Red"}]
[null,"Chest",null,{"$f":"IF('COP Dynamic'!E38=2,\"Green\",IF('COP Dynamic'!E38>=1.335,\"Yellow\",IF('COP Dynamic'!E38>=0.667,\"Orange\",IF('COP Dynamic'!E38>0,\"Brown\",\"Red\"))))","v":"Red"},null,{"$f":"IF('COP Dynamic'!G38=2,\"Green\",IF('COP Dynamic'!G38>=1.335,\"Yellow\",IF('COP Dynamic'!G38>=0.667,\"Orange\",IF('COP Dynamic'!G38>0,\"Brown\",\"Red\"))))","v":"Red"}]
[null,"Side",{"$f":"'COP Dynamic'!D67+'COP Dynamic'!F67","v":0},{"$f":"ROUND(C103,1)","v":0}]
[null,"Head",null,{"$f":"IF('COP Dynamic'!E53=2,\"Green\",IF('COP Dynamic'!E53>=1.335,\"Yellow\",IF('COP Dynamic'!E53>=0.667,\"Orange\",IF('COP Dynamic'!E53>0,\"Brown\",\"Red\"))))","v":"Red"},null,{"$f":"IF('COP Dynamic'!G53=2,\"Green\",IF('COP Dynamic'!G53>=1.335,\"Yellow\",IF('COP Dynamic'!G53>=0.667,\"Orange\",IF('COP Dynamic'!G53>0,\"Brown\",\"Red\"))))","v":"Red"}]
[null,"Neck",null,{"$f":"IF('COP Dynamic'!E56=1,\"Green\",IF('COP Dynamic'!E56>=0.667,\"Yellow\",IF('COP Dynamic'!E56>=0.333,\"Orange\",IF('COP Dynamic'!E56>0,\"Brown\",\"Red\"))))","v":"Red"},null,{"$f":"IF('COP Dynamic'!G56=1,\"Green\",IF('COP Dynamic'!G56>=0.667,\"Yellow\",IF('COP Dynamic'!G56>=0.333,\"Orange\",IF('COP Dynamic'!G56>0,\"Brown\",\"Red\"))))","v":"Red"}]
[null,"Chest",null,{"$f":"IF('COP Dynamic'!E59=1,\"Green\",IF('COP Dynamic'!E59>=0.667,\"Yellow\",IF('COP Dynamic'!E59>=0.333,\"Orange\",IF('COP Dynamic'!E59>0,\"Brown\",\"Red\"))))","v":"Red"},null,{"$f":"IF('COP Dynamic'!G59=1,\"Green\",IF('COP Dynamic'!G59>=0.667,\"Yellow\",IF('COP Dynamic'!G59>=0.333,\"Orange\",IF('COP Dynamic'!G59>0,\"Brown\",\"Red\"))))","v":"Red"}]
[null,"rounded total",{"$f":"ROUND('COP Dynamic'!D71,1)","v":0}]
[null,"Max Dynamic Points",24]
[null,"COP Vehicle-Based"]
[null,"Website Table",null,"Front Passenger","2nd row Outboard","2nd row Centre","3rd row Outboard","3rd row Centre"]
[]
["---->>",null,"ISOFIX"]
["---->>",null,"iSize"]
[null,null,"Top-Tether"]
[null,null,"CPD"]
["---->>",null,"Integrated CRS"]
[null,"rounded total",{"$f":"ROUND('COP Vehicle Based'!D47,1)","v":0}]
[null,"MAX POINTS",13]
[null,"COP CRS Installation"]
[null,"Seat Arrangement",{"$f":"CONCATENATE('General Overview'!C16,'General Overview'!C17,'General Overview'!C18)","v":""}]
[null,"ROUNDED TOTAL",{"$f":"ROUND('COP CRS Installation'!H25,1)","v":0}]
[null,"MAX POINTS",12]
[]
[null,"VRU"]
[null,"VRU Headform"]
["---->>","Start row",15,{"$f":"C126","v":15}]
[null,"Type of car image",{"$f":"'General Overview'!C19","v":0},{"$f":"IF(OR(C127=\"Supermini\",C127=\"Small Family Car\",C127=\"Large Family Car\",C127=\"Executive\",C127=\"Roadster sports\"),\"Normal car\",IF(OR(C127=\"Small Off-Road 4x4\",C127=\"Large Off-Road 4x4\",C127=\"Pick-up\"),\"Off road\",IF(OR(C127=\"Small MPV\",C127=\"Large MPV\"),\"MPV\",IF(C127=\"Business and Family Vans\",\"Van\",\"\"))))","v":""}]
[null,null,18,{"$f":"IF(NOT('VRU Headform'!E5=\"Blue\"),IF(OR('VRU Headform'!E5=\"Red\",'VRU Headform'!E5=\"D Red\"),\"Red\",IF(OR('VRU Headform'!E5=\"Green\",'VRU Headform'!E5=\"D Green\"),\"Green\",'VRU Headform'!E5)))","v":0},{"$f":"IF(NOT('VRU Headform'!F5=\"Blue\"),IF(OR('VRU Headform'!F5=\"Red\",'VRU Headform'!F5=\"D Red\"),\"Red\",IF(OR('VRU Headform'!F5=\"Green\",'VRU Headform'!F5=\"D Green\"),\"Green\",'VRU Headform'!F5)))","v":0},{"$f":"IF(NOT('VRU Headform'!G5=\"Blue\"),IF(OR('VRU Headform'!G5=\"Red\",'VRU Headform'!G5=\"D Red\"),\"Red\",IF(OR('VRU Headform'!G5=\"Green\",'VRU Headform'!G5=\"D Green\"),\"Green\",'VRU Headform'!G5)))","v":0},{"$f":"IF(NOT('VRU Headform'!H5=\"Blue\"),IF(OR('VRU Headform'!H5=\"Red\",'VRU Headform'!H5=\"D Red\"),\"Red\",IF(OR('VRU Headform'!H5=\"Green\",'VRU Headform'!H5=\"D Green\"),\"Green\",'VRU Headform'!H5)))","v":0},{"$f":"IF(NOT('VRU Headform'!I5=\"Blue\"),IF(OR('VRU Headform'!I5=\"Red\",'VRU Headform'!I5=\"D Red\"),\"Red\",IF(OR('VRU Headform'!I5=\"Green\",'VRU Headform'!I5=\"D Green\"),\"Green\",'VRU Headform'!I5)))","v":0},{"$f":"IF(NOT('VRU Headform'!J5=\"Blue\"),IF(OR('VRU Headform'!J5=\"Red\",'VRU Headform'!J5=\"D Red\"),\"Red\",IF(OR('VRU Headform'!J5=\"Green\",'VRU Headform'!J5=\"D Green\"),\"Green\",'VRU Headform'!J5)))","v":0},{"$f":"IF(NOT('VRU Headform'!K5=\"Blue\"),IF(OR('VRU Headform'!K5=\"Red\",'VRU Headform'!K5=\"D Red\"),\"Red\",IF(OR('VRU Headform'!K5=\"Green\",'VRU Headform'!K5=\"D Green\"),\"Green\",'VRU Headform'!K5)))","v":0},{"$f":"IF(NOT('VRU Headform'!L5=\"Blue\"),IF(OR('VRU Headform'!L5=\"Red\",'VRU Headform'!L5=\"D Red\"),\"Red\",IF(OR('VRU Headform'!L5=\"Green\",'VRU Headform'!L5=\"D Green\"),\"Green\",'VRU Headform'!L5)))","v":0},{"$f":"IF(NOT('VRU Headform'!M5=\"Blue\"),IF(OR('VRU Headform'!M5=\"Red\",'VRU Headform'!M5=\"D Red\"),\"Red\",IF(OR('VRU Headform'!M5=\"Green\",'VRU Headform'!M5=\"D Green\"),\"Green\",'VRU Headform'!M5)))","v":0},{"$f":"IF(NOT('VRU Headform'!N5=\"Blue\"),IF(OR('VRU Headform'!N5=\"Red\",'VRU Headform'!N5=\"D Red\"),\"Red\",IF(OR('VRU Headform'!N5=\"Green\",'VRU Headform'!N5=\"D Green\"),\"Green\",'VRU Headform'!N5)))","v":0},{"$f":"IF(NOT('VRU Headform'!O5=\"Blue\"),IF(OR('VRU Headform'!O5=\"Red\",'VRU Headform'!O5=\"D Red\"),\"Red\",IF(OR('VRU Headform'!O5=\"Green\",'VRU Headform'!O5=\"D Green\"),\"Green\",'VRU Headform'!O5)))","v":0},{"$f":"IF(NOT('VRU Headform'!P5=\"Blue\"),IF(OR('VRU Headform'!P5=\"Red\",'VRU Headform'!P5=\"D Red\"),\"Red\",IF(OR('VRU Headform'!P5=\"Green\",'VRU Headform'!P5=\"D Green\"),\"Green\",'VRU Headform'!P5)))","v":0},{"$f":"IF(NOT('VRU Headform'!Q5=\"Blue\"),IF(OR('VRU Headform'!Q5=\"Red\",'VRU Headform'!Q5=\"D Red\"),\"Red\",IF(OR('VRU Headform'!Q5=\"Green\",'VRU Headform'!Q5=\"D Green\"),\"Green\",'VRU Headform'!Q5)))","v":0},{"$f":"IF(NOT('VRU Headform'!R5=\"Blue\"),IF(OR('VRU Headform'!R5=\"Red\",'VRU Headform'!R5=\"D Red\"),\"Red\",IF(OR('VRU Headform'!R5=\"Green\",'VRU Headform'!R5=\"D Green\"),\"Green\",'VRU Headform'!R5)))","v":0},{"$f":"IF(NOT('VRU Headform'!S5=\"Blue\"),IF(OR('VRU Headform'!S5=\"Red\",'VRU Headform'!S5=\"D Red\"),\"Red\",IF(OR('VRU Headform'!S5=\"Green\",'VRU Headform'!S5=\"D Green\"),\"Green\",'VRU Headform'!S5)))","v":0},{"$f":"IF(NOT('VRU Headform'!T5=\"Blue\"),IF(OR('VRU Headform'!T5=\"Red\",'VRU Headform'!T5=\"D Red\"),\"Red\",IF(OR('VRU Headform'!T5=\"Green\",'VRU Headform'!T5=\"D Green\"),\"Green\",'VRU Headform'!T5)))","v":0},{"$f":"IF(NOT('VRU Headform'!U5=\"Blue\"),IF(OR('VRU Headform'!U5=\"Red\",'VRU Headform'!U5=\"D Red\"),\"Red\",IF(OR('VRU Headform'!U5=\"Green\",'VRU Headform'!U5=\"D Green\"),\"Green\",'VRU Headform'!U5)))","v":0},{"$f":"IF(NOT('VRU Headform'!V5=\"Blue\"),IF(OR('VRU Headform'!V5=\"Red\",'VRU Headform'!V5=\"D Red\"),\"Red\",IF(OR('VRU Headform'!V5=\"Green\",'VRU Headform'!V5=\"D Green\"),\"Green\",'VRU Headform'!V5)))","v":0},{"$f":"IF(NOT('VRU Headform'!W5=\"Blue\"),IF(OR('VRU Headform'!W5=\"Red\",'VRU Headform'!W5=\"D Red\"),\"Red\",IF(OR('VRU Headform'!W5=\"Green\",'VRU Headform'!W5=\"D Green\"),\"Green\",'VRU Headform'!W5)))","v":0},{"$f":"IF(NOT('VRU Headform'!X5=\"Blue\"),IF(OR('VRU Headform'!X5=\"Red\",'VRU Headform'!X5=\"D Red\"),\"Red\",IF(OR('VRU Headform'!X5=\"Green\",'VRU Headform'!X5=\"D Green\"),\"Green\",'VRU Headform'!X5)))","v":0},{"$f":"IF(NOT('VRU Headform'!Y5=\"Blue\"),IF(OR('VRU Headform'!Y5=\"Red\",'VRU Headform'!Y5=\"D Red\"),\"Red\",IF(OR('VRU Headform'!Y5=\"Green\",'VRU Headform'!Y5=\"D Green\"),\"Green\",'VRU Headform'!Y5)))","v":0},{"$f":"IF(C128=$C$126,\"Yes\",\"No\")","v":"No"}]
[null,null,17,{"$f":"IF(NOT('VRU Headform'!E6=\"Blue\"),IF(OR('VRU Headform'!E6=\"Red\",'VRU Headform'!E6=\"D Red\"),\"Red\",IF(OR('VRU Headform'!E6=\"Green\",'VRU Headform'!E6=\"D Green\"),\"Green\",'VRU Headform'!E6)))","v":0},{"$f":"IF(NOT('VRU Headform'!F6=\"Blue\"),IF(OR('VRU Headform'!F6=\"Red\",'VRU Headform'!F6=\"D Red\"),\"Red\",IF(OR('VRU Headform'!F6=\"Green\",'VRU Headform'!F6=\"D Green\"),\"Green\",'VRU Headform'!F6)))","v":0},{"$f":"IF(NOT('VRU Headform'!G6=\"Blue\"),IF(OR('VRU Headform'!G6=\"Red\",'VRU Headform'!G6=\"D Red\"),\"Red\",IF(OR('VRU Headform'!G6=\"Green\",'VRU Headform'!G6=\"D Green\"),\"Green\",'VRU Headform'!G6)))","v":0},{"$f":"IF(NOT('VRU Headform'!H6=\"Blue\"),IF(OR('VRU Headform'!H6=\"Red\",'VRU Headform'!H6=\"D Red\"),\"Red\",IF(OR('VRU Headform'!H6=\"Green\",'VRU Headform'!H6=\"D Green\"),\"Green\",'VRU Headform'!H6)))","v":0},{"$f":"IF(NOT('VRU Headform'!I6=\"Blue\"),IF(OR('VRU Headform'!I6=\"Red\",'VRU Headform'!I6=\"D Red\"),\"Red\",IF(OR('VRU Headform'!I6=\"Green\",'VRU Headform'!I6=\"D Green\"),\"Green\",'VRU Headform'!I6)))","v":0},{"$f":"IF(NOT('VRU Headform'!J6=\"Blue\"),IF(OR('VRU Headform'!J6=\"Red\",'VRU Headform'!J6=\"D Red\"),\"Red\",IF(OR('VRU Headform'!J6=\"Green\",'VRU Headform'!J6=\"D Green\"),\"Green\",'VRU Headform'!J6)))","v":0},{"$f":"IF(NOT('VRU Headform'!K6=\"Blue\"),IF(OR('VRU Headform'!K6=\"Red\",'VRU Headform'!K6=\"D Red\"),\"Red\",IF(OR('VRU Headform'!K6=\"Green\",'VRU Headform'!K6=\"D Green\"),\"Green\",'VRU Headform'!K6)))","v":0},{"$f":"IF(NOT('VRU Headform'!L6=\"Blue\"),IF(OR('VRU Headform'!L6=\"Red\",'VRU Headform'!L6=\"D Red\"),\"Red\",IF(OR('VRU Headform'!L6=\"Green\",'VRU Headform'!L6=\"D Green\"),\"Green\",'VRU Headform'!L6)))","v":0},{"$f":"IF(NOT('VRU Headform'!M6=\"Blue\"),IF(OR('VRU Headform'!M6=\"Red\",'VRU Headform'!M6=\"D Red\"),\"Red\",IF(OR('VRU Headform'!M6=\"Green\",'VRU Headform'!M6=\"D Green\"),\"Green\",'VRU Headform'!M6)))","v":0},{"$f":"IF(NOT('VRU Headform'!N6=\"Blue\"),IF(OR('VRU Headform'!N6=\"Red\",'VRU Headform'!N6=\"D Red\"),\"Red\",IF(OR('VRU Headform'!N6=\"Green\",'VRU Headform'!N6=\"D Green\"),\"Green\",'VRU Headform'!N6)))","v":0},{"$f":"IF(NOT('VRU Headform'!O6=\"Blue\"),IF(OR('VRU Headform'!O6=\"Red\",'VRU Headform'!O6=\"D Red\"),\"Red\",IF(OR('VRU Headform'!O6=\"Green\",'VRU Headform'!O6=\"D Green\"),\"Green\",'VRU Headform'!O6)))","v":0},{"$f":"IF(NOT('VRU Headform'!P6=\"Blue\"),IF(OR('VRU Headform'!P6=\"Red\",'VRU Headform'!P6=\"D Red\"),\"Red\",IF(OR('VRU Headform'!P6=\"Green\",'VRU Headform'!P6=\"D Green\"),\"Green\",'VRU Headform'!P6)))","v":0},{"$f":"IF(NOT('VRU Headform'!Q6=\"Blue\"),IF(OR('VRU Headform'!Q6=\"Red\",'VRU Headform'!Q6=\"D Red\"),\"Red\",IF(OR('VRU Headform'!Q6=\"Green\",'VRU Headform'!Q6=\"D Green\"),\"Green\",'VRU Headform'!Q6)))","v":0},{"$f":"IF(NOT('VRU Headform'!R6=\"Blue\"),IF(OR('VRU Headform'!R6=\"Red\",'VRU Headform'!R6=\"D Red\"),\"Red\",IF(OR('VRU Headform'!R6=\"Green\",'VRU Headform'!R6=\"D Green\"),\"Green\",'VRU Headform'!R6)))","v":0},{"$f":"IF(NOT('VRU Headform'!S6=\"Blue\"),IF(OR('VRU Headform'!S6=\"Red\",'VRU Headform'!S6=\"D Red\"),\"Red\",IF(OR('VRU Headform'!S6=\"Green\",'VRU Headform'!S6=\"D Green\"),\"Green\",'VRU Headform'!S6)))","v":0},{"$f":"IF(NOT('VRU Headform'!T6=\"Blue\"),IF(OR('VRU Headform'!T6=\"Red\",'VRU Headform'!T6=\"D Red\"),\"Red\",IF(OR('VRU Headform'!T6=\"Green\",'VRU Headform'!T6=\"D Green\"),\"Green\",'VRU Headform'!T6)))","v":0},{"$f":"IF(NOT('VRU Headform'!U6=\"Blue\"),IF(OR('VRU Headform'!U6=\"Red\",'VRU Headform'!U6=\"D Red\"),\"Red\",IF(OR('VRU Headform'!U6=\"Green\",'VRU Headform'!U6=\"D Green\"),\"Green\",'VRU Headform'!U6)))","v":0},{"$f":"IF(NOT('VRU Headform'!V6=\"Blue\"),IF(OR('VRU Headform'!V6=\"Red\",'VRU Headform'!V6=\"D Red\"),\"Red\",IF(OR('VRU Headform'!V6=\"Green\",'VRU Headform'!V6=\"D Green\"),\"Green\",'VRU Headform'!V6)))","v":0},{"$f":"IF(NOT('VRU Headform'!W6=\"Blue\"),IF(OR('VRU Headform'!W6=\"Red\",'VRU Headform'!W6=\"D Red\"),\"Red\",IF(OR('VRU Headform'!W6=\"Green\",'VRU Headform'!W6=\"D Green\"),\"Green\",'VRU Headform'!W6)))","v":0},{"$f":"IF(NOT('VRU Headform'!X6=\"Blue\"),IF(OR('VRU Headform'!X6=\"Red\",'VRU Headform'!X6=\"D Red\"),\"Red\",IF(OR('VRU Headform'!X6=\"Green\",'VRU Headform'!X6=\"D Green\"),\"Green\",'VRU Headform'!X6)))","v":0},{"$f":"IF(NOT('VRU Headform'!Y6=\"Blue\"),IF(OR('VRU Headform'!Y6=\"Red\",'VRU Headform'!Y6=\"D Red\"),\"Red\",IF(OR('VRU Headform'!Y6=\"Green\",'VRU Headform'!Y6=\"D Green\"),\"Green\",'VRU Headform'!Y6)))","v":0},"No"]
[null,null,16,{"$f":"IF(NOT('VRU Headform'!E7=\"Blue\"),IF(OR('VRU Headform'!E7=\"Red\",'VRU Headform'!E7=\"D Red\"),\"Red\",IF(OR('VRU Headform'!E7=\"Green\",'VRU Headform'!E7=\"D Green\"),\"Green\",'VRU Headform'!E7)))","v":0},{"$f":"IF(NOT('VRU Headform'!F7=\"Blue\"),IF(OR('VRU Headform'!F7=\"Red\",'VRU Headform'!F7=\"D Red\"),\"Red\",IF(OR('VRU Headform'!F7=\"Green\",'VRU Headform'!F7=\"D Green\"),\"Green\",'VRU Headform'!F7)))","v":0},{"$f":"IF(NOT('VRU Headform'!G7=\"Blue\"),IF(OR('VRU Headform'!G7=\"Red\",'VRU Headform'!G7=\"D Red\"),\"Red\",IF(OR('VRU Headform'!G7=\"Green\",'VRU Headform'!G7=\"D Green\"),\"Green\",'VRU Headform'!G7)))","v":0},{"$f":"IF(NOT('VRU Headform'!H7=\"Blue\"),IF(OR('VRU Headform'!H7=\"Red\",'VRU Headform'!H7=\"D Red\"),\"Red\",IF(OR('VRU Headform'!H7=\"Green\",'VRU Headform'!H7=\"D Green\"),\"Green\",'VRU Headform'!H7)))","v":0},{"$f":"IF(NOT('VRU Headform'!I7=\"Blue\"),IF(OR('VRU Headform'!I7=\"Red\",'VRU Headform'!I7=\"D Red\"),\"Red\",IF(OR('VRU Headform'!I7=\"Green\",'VRU Headform'!I7=\"D Green\"),\"Green\",'VRU Headform'!I7)))","v":0},{"$f":"IF(NOT('VRU Headform'!J7=\"Blue\"),IF(OR('VRU Headform'!J7=\"Red\",'VRU Headform'!J7=\"D Red\"),\"Red\",IF(OR('VRU Headform'!J7=\"Green\",'VRU Headform'!J7=\"D Green\"),\"Green\",'VRU Headform'!J7)))","v":0},{"$f":"IF(NOT('VRU Headform'!K7=\"Blue\"),IF(OR('VRU Headform'!K7=\"Red\",'VRU Headform'!K7=\"D Red\"),\"Red\",IF(OR('VRU Headform'!K7=\"Green\",'VRU Headform'!K7=\"D Green\"),\"Green\",'VRU Headform'!K7)))","v":0},{"$f":"IF(NOT('VRU Headform'!L7=\"Blue\"),IF(OR('VRU Headform'!L7=\"Red\",'VRU Headform'!L7=\"D Red\"),\"Red\",IF(OR('VRU Headform'!L7=\"Green\",'VRU Headform'!L7=\"D Green\"),\"Green\",'VRU Headform'!L7)))","v":0},{"$f":"IF(NOT('VRU Headform'!M7=\"Blue\"),IF(OR('VRU Headform'!M7=\"Red\",'VRU Headform'!M7=\"D Red\"),\"Red\",IF(OR('VRU Headform'!M7=\"Green\",'VRU Headform'!M7=\"D Green\"),\"Green\",'VRU Headform'!M7)))","v":0},{"$f":"IF(NOT('VRU Headform'!N7=\"Blue\"),IF(OR('VRU Headform'!N7=\"Red\",'VRU Headform'!N7=\"D Red\"),\"Red\",IF(OR('VRU Headform'!N7=\"Green\",'VRU Headform'!N7=\"D Green\"),\"Green\",'VRU Headform'!N7)))","v":0},{"$f":"IF(NOT('VRU Headform'!O7=\"Blue\"),IF(OR('VRU Headform'!O7=\"Red\",'VRU Headform'!O7=\"D Red\"),\"Red\",IF(OR('VRU Headform'!O7=\"Green\",'VRU Headform'!O7=\"D Green\"),\"Green\",'VRU Headform'!O7)))","v":0},{"$f":"IF(NOT('VRU Headform'!P7=\"Blue\"),IF(OR('VRU Headform'!P7=\"Red\",'VRU Headform'!P7=\"D Red\"),\"Red\",IF(OR('VRU Headform'!P7=\"Green\",'VRU Headform'!P7=\"D Green\"),\"Green\",'VRU Headform'!P7)))","v":0},{"$f":"IF(NOT('VRU Headform'!Q7=\"Blue\"),IF(OR('VRU Headform'!Q7=\"Red\",'VRU Headform'!Q7=\"D Red\"),\"Red\",IF(OR('VRU Headform'!Q7=\"Green\",'VRU Headform'!Q7=\"D Green\"),\"Green\",'VRU Headform'!Q7)))","v":0},{"$f":"IF(NOT('VRU Headform'!R7=\"Blue\"),IF(OR('VRU Headform'!R7=\"Red\",'VRU Headform'!R7=\"D Red\"),\"Red\",IF(OR('VRU Headform'!R7=\"Green\",'VRU Headform'!R7=\"D Green\"),\"Green\",'VRU Headform'!R7)))","v":0},{"$f":"IF(NOT('VRU Headform'!S7=\"Blue\"),IF(OR('VRU Headform'!S7=\"Red\",'VRU Headform'!S7=\"D Red\"),\"Red\",IF(OR('VRU Headform'!S7=\"Green\",'VRU Headform'!S7=\"D Green\"),\"Green\",'VRU Headform'!S7)))","v":0},{"$f":"IF(NOT('VRU Headform'!T7=\"Blue\"),IF(OR('VRU Headform'!T7=\"Red\",'VRU Headform'!T7=\"D Red\"),\"Red\",IF(OR('VRU Headform'!T7=\"Green\",'VRU Headform'!T7=\"D Green\"),\"Green\",'VRU Headform'!T7)))","v":0},{"$f":"IF(NOT('VRU Headform'!U7=\"Blue\"),IF(OR('VRU Headform'!U7=\"Red\",'VRU Headform'!U7=\"D Red\"),\"Red\",IF(OR('VRU Headform'!U7=\"Green\",'VRU Headform'!U7=\"D Green\"),\"Green\",'VRU Headform'!U7)))","v":0},{"$f":"IF(NOT('VRU Headform'!V7=\"Blue\"),IF(OR('VRU Headform'!V7=\"Red\",'VRU Headform'!V7=\"D Red\"),\"Red\",IF(OR('VRU Headform'!V7=\"Green\",'VRU Headform'!V7=\"D Green\"),\"Green\",'VRU Headform'!V7)))","v":0},{"$f":"IF(NOT('VRU Headform'!W7=\"Blue\"),IF(OR('VRU Headform'!W7=\"Red\",'VRU Headform'!W7=\"D Red\"),\"Red\",IF(OR('VRU Headform'!W7=\"Green\",'VRU Headform'!W7=\"D Green\"),\"Green\",'VRU Headform'!W7)))","v":0},{"$f":"IF(NOT('VRU Headform'!X7=\"Blue\"),IF(OR('VRU Headform'!X7=\"Red\",'VRU Headform'!X7=\"D Red\"),\"Red\",IF(OR('VRU Headform'!X7=\"Green\",'VRU Headform'!X7=\"D Green\"),\"Green\",'VRU Headform'!X7)))","v":0},{"$f":"IF(NOT('VRU Headform'!Y7=\"Blue\"),IF(OR('VRU Headform'!Y7=\"Red\",'VRU Headform'!Y7=\"D Red\"),\"Red\",IF(OR('VRU Headform'!Y7=\"Green\",'VRU Headform'!Y7=\"D Green\"),\"Green\",'VRU Headform'!Y7)))","v":0},"No"]
[null,null,15,{"$f":"IF(NOT('VRU Headform'!E8=\"Blue\"),IF(OR('VRU Headform'!E8=\"Red\",'VRU Headform'!E8=\"D Red\"),\"Red\",IF(OR('VRU Headform'!E8=\"Green\",'VRU Headform'!E8=\"D Green\"),\"Green\",'VRU Headform'!E8)))","v":0},{"$f":"IF(NOT('VRU Headform'!F8=\"Blue\"),IF(OR('VRU Headform'!F8=\"Red\",'VRU Headform'!F8=\"D Red\"),\"Red\",IF(OR('VRU Headform'!F8=\"Green\",'VRU Headform'!F8=\"D Green\"),\"Green\",'VRU Headform'!F8)))","v":0},{"$f":"IF(NOT('VRU Headform'!G8=\"Blue\"),IF(OR('VRU Headform'!G8=\"Red\",'VRU Headform'!G8=\"D Red\"),\"Red\",IF(OR('VRU Headform'!G8=\"Green\",'VRU Headform'!G8=\"D Green\"),\"Green\",'VRU Headform'!G8)))","v":0},{"$f":"IF(NOT('VRU Headform'!H8=\"Blue\"),IF(OR('VRU Headform'!H8=\"Red\",'VRU Headform'!H8=\"D Red\"),\"Red\",IF(OR('VRU Headform'!H8=\"Green\",'VRU Headform'!H8=\"D Green\"),\"Green\",'VRU Headform'!H8)))","v":0},{"$f":"IF(NOT('VRU Headform'!I8=\"Blue\"),IF(OR('VRU Headform'!I8=\"Red\",'VRU Headform'!I8=\"D Red\"),\"Red\",IF(OR('VRU Headform'!I8=\"Green\",'VRU Headform'!I8=\"D Green\"),\"Green\",'VRU Headform'!I8)))","v":0},{"$f":"IF(NOT('VRU Headform'!J8=\"Blue\"),IF(OR('VRU Headform'!J8=\"Red\",'VRU Headform'!J8=\"D Red\"),\"Red\",IF(OR('VRU Headform'!J8=\"Green\",'VRU Headform'!J8=\"D Green\"),\"Green\",'VRU Headform'!J8)))","v":0},{"$f":"IF(NOT('VRU Headform'!K8=\"Blue\"),IF(OR('VRU Headform'!K8=\"Red\",'VRU Headform'!K8=\"D Red\"),\"Red\",IF(OR('VRU Headform'!K8=\"Green\",'VRU Headform'!K8=\"D Green\"),\"Green\",'VRU Headform'!K8)))","v":0},{"$f":"IF(NOT('VRU Headform'!L8=\"Blue\"),IF(OR('VRU Headform'!L8=\"Red\",'VRU Headform'!L8=\"D Red\"),\"Red\",IF(OR('VRU Headform'!L8=\"Green\",'VRU Headform'!L8=\"D Green\"),\"Green\",'VRU Headform'!L8)))","v":0},{"$f":"IF(NOT('VRU Headform'!M8=\"Blue\"),IF(OR('VRU Headform'!M8=\"Red\",'VRU Headform'!M8=\"D Red\"),\"Red\",IF(OR('VRU Headform'!M8=\"Green\",'VRU Headform'!M8=\"D Green\"),\"Green\",'VRU Headform'!M8)))","v":0},{"$f":"IF(NOT('VRU Headform'!N8=\"Blue\"),IF(OR('VRU Headform'!N8=\"Red\",'VRU Headform'!N8=\"D Red\"),\"Red\",IF(OR('VRU Headform'!N8=\"Green\",'VRU Headform'!N8=\"D Green\"),\"Green\",'VRU Headform'!N8)))","v":0},{"$f":"IF(NOT('VRU Headform'!O8=\"Blue\"),IF(OR('VRU Headform'!O8=\"Red\",'VRU Headform'!O8=\"D Red\"),\"Red\",IF(OR('VRU Headform'!O8=\"Green\",'VRU Headform'!O8=\"D Green\"),\"Green\",'VRU Headform'!O8)))","v":0},{"$f":"IF(NOT('VRU Headform'!P8=\"Blue\"),IF(OR('VRU Headform'!P8=\"Red\",'VRU Headform'!P8=\"D Red\"),\"Red\",IF(OR('VRU Headform'!P8=\"Green\",'VRU Headform'!P8=\"D Green\"),\"Green\",'VRU Headform'!P8)))","v":0},{"$f":"IF(NOT('VRU Headform'!Q8=\"Blue\"),IF(OR('VRU Headform'!Q8=\"Red\",'VRU Headform'!Q8=\"D Red\"),\"Red\",IF(OR('VRU Headform'!Q8=\"Green\",'VRU Headform'!Q8=\"D Green\"),\"Green\",'VRU Headform'!Q8)))","v":0},{"$f":"IF(NOT('VRU Headform'!R8=\"Blue\"),IF(OR('VRU Headform'!R8=\"Red\",'VRU Headform'!R8=\"D Red\"),\"Red\",IF(OR('VRU Headform'!R8=\"Green\",'VRU Headform'!R8=\"D Green\"),\"Green\",'VRU Headform'!R8)))","v":0},{"$f":"IF(NOT('VRU Headform'!S8=\"Blue\"),IF(OR('VRU Headform'!S8=\"Red\",'VRU Headform'!S8=\"D Red\"),\"Red\",IF(OR('VRU Headform'!S8=\"Green\",'VRU Headform'!S8=\"D Green\"),\"Green\",'VRU Headform'!S8)))","v":0},{"$f":"IF(NOT('VRU Headform'!T8=\"Blue\"),IF(OR('VRU Headform'!T8=\"Red\",'VRU Headform'!T8=\"D Red\"),\"Red\",IF(OR('VRU Headform'!T8=\"Green\",'VRU Headform'!T8=\"D Green\"),\"Green\",'VRU Headform'!T8)))","v":0},{"$f":"IF(NOT('VRU Headform'!U8=\"Blue\"),IF(OR('VRU Headform'!U8=\"Red\",'VRU Headform'!U8=\"D Red\"),\"Red\",IF(OR('VRU Headform'!U8=\"Green\",'VRU Headform'!U8=\"D Green\"),\"Green\",'VRU Headform'!U8)))","v":0},{"$f":"IF(NOT('VRU Headform'!V8=\"Blue\"),IF(OR('VRU Headform'!V8=\"Red\",'VRU Headform'!V8=\"D Red\"),\"Red\",IF(OR('VRU Headform'!V8=\"Green\",'VRU Headform'!V8=\"D Green\"),\"Green\",'VRU Headform'!V8)))","v":0},{"$f":"IF(NOT('VRU Headform'!W8=\"Blue\"),IF(OR('VRU Headform'!W8=\"Red\",'VRU Headform'!W8=\"D Red\"),\"Red\",IF(OR('VRU Headform'!W8=\"Green\",'VRU Headform'!W8=\"D Green\"),\"Green\",'VRU Headform'!W8)))","v":0},{"$f":"IF(NOT('VRU Headform'!X8=\"Blue\"),IF(OR('VRU Headform'!X8=\"Red\",'VRU Headform'!X8=\"D Red\"),\"Red\",IF(OR('VRU Headform'!X8=\"Green\",'VRU Headform'!X8=\"D Green\"),\"Green\",'VRU Headform'!X8)))","v":0},{"$f":"IF(NOT('VRU Headform'!Y8=\"Blue\"),IF(OR('VRU Headform'!Y8=\"Red\",'VRU Headform'!Y8=\"D Red\"),\"Red\",IF(OR('VRU Headform'!Y8=\"Green\",'VRU Headform'!Y8=\"D Green\"),\"Green\",'VRU Headform'!Y8)))","v":0},"Yes"]
[null,null,14,{"$f":"IF(NOT('VRU Headform'!E9=\"Blue\"),IF(OR('VRU Headform'!E9=\"Red\",'VRU Headform'!E9=\"D Red\"),\"Red\",IF(OR('VRU Headform'!E9=\"Green\",'VRU Headform'!E9=\"D Green\"),\"Green\",'VRU Headform'!E9)))","v":0},{"$f":"IF(NOT('VRU Headform'!F9=\"Blue\"),IF(OR('VRU Headform'!F9=\"Red\",'VRU Headform'!F9=\"D Red\"),\"Red\",IF(OR('VRU Headform'!F9=\"Green\",'VRU Headform'!F9=\"D Green\"),\"Green\",'VRU Headform'!F9)))","v":0},{"$f":"IF(NOT('VRU Headform'!G9=\"Blue\"),IF(OR('VRU Headform'!G9=\"Red\",'VRU Headform'!G9=\"D Red\"),\"Red\",IF(OR('VRU Headform'!G9=\"Green\",'VRU Headform'!G9=\"D Green\"),\"Green\",'VRU Headform'!G9)))","v":0},{"$f":"IF(NOT('VRU Headform'!H9=\"Blue\"),IF(OR('VRU Headform'!H9=\"Red\",'VRU Headform'!H9=\"D Red\"),\"Red\",IF(OR('VRU Headform'!H9=\"Green\",'VRU Headform'!H9=\"D Green\"),\"Green\",'VRU Headform'!H9)))","v":0},{"$f":"IF(NOT('VRU Headform'!I9=\"Blue\"),IF(OR('VRU Headform'!I9=\"Red\",'VRU Headform'!I9=\"D Red\"),\"Red\",IF(OR('VRU Headform'!I9=\"Green\",'VRU Headform'!I9=\"D Green\"),\"Green\",'VRU Headform'!I9)))","v":0},{"$f":"IF(NOT('VRU Headform'!J9=\"Blue\"),IF(OR('VRU Headform'!J9=\"Red\",'VRU Headform'!J9=\"D Red\"),\"Red\",IF(OR('VRU Headform'!J9=\"Green\",'VRU Headform'!J9=\"D Green\"),\"Green\",'VRU Headform'!J9)))","v":0},{"$f":"IF(NOT('VRU Headform'!K9=\"Blue\"),IF(OR('VRU Headform'!K9=\"Red\",'VRU Headform'!K9=\"D Red\"),\"Red\",IF(OR('VRU Headform'!K9=\"Green\",'VRU Headform'!K9=\"D Green\"),\"Green\",'VRU Headform'!K9)))","v":0},{"$f":"IF(NOT('VRU Headform'!L9=\"Blue\"),IF(OR('VRU Headform'!L9=\"Red\",'VRU Headform'!L9=\"D Red\"),\"Red\",IF(OR('VRU Headform'!L9=\"Green\",'VRU Headform'!L9=\"D Green\"),\"Green\",'VRU Headform'!L9)))","v":0},{"$f":"IF(NOT('VRU Headform'!M9=\"Blue\"),IF(OR('VRU Headform'!M9=\"Red\",'VRU Headform'!M9=\"D Red\"),\"Red\",IF(OR('VRU Headform'!M9=\"Green\",'VRU Headform'!M9=\"D Green\"),\"Green\",'VRU Headform'!M9)))","v":0},{"$f":"IF(NOT('VRU Headform'!N9=\"Blue\"),IF(OR('VRU Headform'!N9=\"Red\",'VRU Headform'!N9=\"D Red\"),\"Red\",IF(OR('VRU Headform'!N9=\"Green\",'VRU Headform'!N9=\"D Green\"),\"Green\",'VRU Headform'!N9)))","v":0},{"$f":"IF(NOT('VRU Headform'!O9=\"Blue\"),IF(OR('VRU Headform'!O9=\"Red\",'VRU Headform'!O9=\"D Red\"),\"Red\",IF(OR('VRU Headform'!O9=\"Green\",'VRU Headform'!O9=\"D Green\"),\"Green\",'VRU Headform'!O9)))","v":0},{"$f":"IF(NOT('VRU Headform'!P9=\"Blue\"),IF(OR('VRU Headform'!P9=\"Red\",'VRU Headform'!P9=\"D Red\"),\"Red\",IF(OR('VRU Headform'!P9=\"Green\",'VRU Headform'!P9=\"D Green\"),\"Green\",'VRU Headform'!P9)))","v":0},{"$f":"IF(NOT('VRU Headform'!Q9=\"Blue\"),IF(OR('VRU Headform'!Q9=\"Red\",'VRU Headform'!Q9=\"D Red\"),\"Red\",IF(OR('VRU Headform'!Q9=\"Green\",'VRU Headform'!Q9=\"D Green\"),\"Green\",'VRU Headform'!Q9)))","v":0},{"$f":"IF(NOT('VRU Headform'!R9=\"Blue\"),IF(OR('VRU Headform'!R9=\"Red\",'VRU Headform'!R9=\"D Red\"),\"Red\",IF(OR('VRU Headform'!R9=\"Green\",'VRU Headform'!R9=\"D Green\"),\"Green\",'VRU Headform'!R9)))","v":0},{"$f":"IF(NOT('VRU Headform'!S9=\"Blue\"),IF(OR('VRU Headform'!S9=\"Red\",'VRU Headform'!S9=\"D Red\"),\"Red\",IF(OR('VRU Headform'!S9=\"Green\",'VRU Headform'!S9=\"D Green\"),\"Green\",'VRU Headform'!S9)))","v":0},{"$f":"IF(NOT('VRU Headform'!T9=\"Blue\"),IF(OR('VRU Headform'!T9=\"Red\",'VRU Headform'!T9=\"D Red\"),\"Red\",IF(OR('VRU Headform'!T9=\"Green\",'VRU Headform'!T9=\"D Green\"),\"Green\",'VRU Headform'!T9)))","v":0},{"$f":"IF(NOT('VRU Headform'!U9=\"Blue\"),IF(OR('VRU Headform'!U9=\"Red\",'VRU Headform'!U9=\"D Red\"),\"Red\",IF(OR('VRU Headform'!U9=\"Green\",'VRU Headform'!U9=\"D Green\"),\"Green\",'VRU Headform'!U9)))","v":0},{"$f":"IF(NOT('VRU Headform'!V9=\"Blue\"),IF(OR('VRU Headform'!V9=\"Red\",'VRU Headform'!V9=\"D Red\"),\"Red\",IF(OR('VRU Headform'!V9=\"Green\",'VRU Headform'!V9=\"D Green\"),\"Green\",'VRU Headform'!V9)))","v":0},{"$f":"IF(NOT('VRU Headform'!W9=\"Blue\"),IF(OR('VRU Headform'!W9=\"Red\",'VRU Headform'!W9=\"D Red\"),\"Red\",IF(OR('VRU Headform'!W9=\"Green\",'VRU Headform'!W9=\"D Green\"),\"Green\",'VRU Headform'!W9)))","v":0},{"$f":"IF(NOT('VRU Headform'!X9=\"Blue\"),IF(OR('VRU Headform'!X9=\"Red\",'VRU Headform'!X9=\"D Red\"),\"Red\",IF(OR('VRU Headform'!X9=\"Green\",'VRU Headform'!X9=\"D Green\"),\"Green\",'VRU Headform'!X9)))","v":0},{"$f":"IF(NOT('VRU Headform'!Y9=\"Blue\"),IF(OR('VRU Headform'!Y9=\"Red\",'VRU Headform'!Y9=\"D Red\"),\"Red\",IF(OR('VRU Headform'!Y9=\"Green\",'VRU Headform'!Y9=\"D Green\"),\"Green\",'VRU Headform'!Y9)))","v":0},"No"]
[null,null,13,{"$f":"IF(NOT('VRU Headform'!E10=\"Blue\"),IF(OR('VRU Headform'!E10=\"Red\",'VRU Headform'!E10=\"D Red\"),\"Red\",IF(OR('VRU Headform'!E10=\"Green\",'VRU Headform'!E10=\"D Green\"),\"Green\",'VRU Headform'!E10)))","v":0},{"$f":"IF(NOT('VRU Headform'!F10=\"Blue\"),IF(OR('VRU Headform'!F10=\"Red\",'VRU Headform'!F10=\"D Red\"),\"Red\",IF(OR('VRU Headform'!F10=\"Green\",'VRU Headform'!F10=\"D Green\"),\"Green\",'VRU Headform'!F10)))","v":0},{"$f":"IF(NOT('VRU Headform'!G10=\"Blue\"),IF(OR('VRU Headform'!G10=\"Red\",'VRU Headform'!G10=\"D Red\"),\"Red\",IF(OR('VRU Headform'!G10=\"Green\",'VRU Headform'!G10=\"D Green\"),\"Green\",'VRU Headform'!G10)))","v":0},{"$f":"IF(NOT('VRU Headform'!H10=\"Blue\"),IF(OR('VRU Headform'!H10=\"Red\",'VRU Headform'!H10=\"D Red\"),\"Red\",IF(OR('VRU Headform'!H10=\"Green\",'VRU Headform'!H10=\"D Green\"),\"Green\",'VRU Headform'!H10)))","v":0},{"$f":"IF(NOT('VRU Headform'!I10=\"Blue\"),IF(OR('VRU Headform'!I10=\"Red\",'VRU Headform'!I10=\"D Red\"),\"Red\",IF(OR('VRU Headform'!I10=\"Green\",'VRU Headform'!I10=\"D Green\"),\"Green\",'VRU Headform'!I10)))","v":0},{"$f":"IF(NOT('VRU Headform'!J10=\"Blue\"),IF(OR('VRU Headform'!J10=\"Red\",'VRU Headform'!J10=\"D Red\"),\"Red\",IF(OR('VRU Headform'!J10=\"Green\",'VRU Headform'!J10=\"D Green\"),\"Green\",'VRU Headform'!J10)))","v":0},{"$f":"IF(NOT('VRU Headform'!K10=\"Blue\"),IF(OR('VRU Headform'!K10=\"Red\",'VRU Headform'!K10=\"D Red\"),\"Red\",IF(OR('VRU Headform'!K10=\"Green\",'VRU Headform'!K10=\"D Green\"),\"Green\",'VRU Headform'!K10)))","v":0},{"$f":"IF(NOT('VRU Headform'!L10=\"Blue\"),IF(OR('VRU Headform'!L10=\"Red\",'VRU Headform'!L10=\"D Red\"),\"Red\",IF(OR('VRU Headform'!L10=\"Green\",'VRU Headform'!L10=\"D Green\"),\"Green\",'VRU Headform'!L10)))","v":0},{"$f":"IF(NOT('VRU Headform'!M10=\"Blue\"),IF(OR('VRU Headform'!M10=\"Red\",'VRU Headform'!M10=\"D Red\"),\"Red\",IF(OR('VRU Headform'!M10=\"Green\",'VRU Headform'!M10=\"D Green\"),\"Green\",'VRU Headform'!M10)))","v":0},{"$f":"IF(NOT('VRU Headform'!N10=\"Blue\"),IF(OR('VRU Headform'!N10=\"Red\",'VRU Headform'!N10=\"D Red\"),\"Red\",IF(OR('VRU Headform'!N10=\"Green\",'VRU Headform'!N10=\"D Green\"),\"Green\",'VRU Headform'!N10)))","v":0},{"$f":"IF(NOT('VRU Headform'!O10=\"Blue\"),IF(OR('VRU Headform'!O10=\"Red\",'VRU Headform'!O10=\"D Red\"),\"Red\",IF(OR('VRU Headform'!O10=\"Green\",'VRU Headform'!O10=\"D Green\"),\"Green\",'VRU Headform'!O10)))","v":0},{"$f":"IF(NOT('VRU Headform'!P10=\"Blue\"),IF(OR('VRU Headform'!P10=\"Red\",'VRU Headform'!P10=\"D Red\"),\"Red\",IF(OR('VRU Headform'!P10=\"Green\",'VRU Headform'!P10=\"D Green\"),\"Green\",'VRU Headform'!P10)))","v":0},{"$f":"IF(NOT('VRU Headform'!Q10=\"Blue\"),IF(OR('VRU Headform'!Q10=\"Red\",'VRU Headform'!Q10=\"D Red\"),\"Red\",IF(OR('VRU Headform'!Q10=\"Green\",'VRU Headform'!Q10=\"D Green\"),\"Green\",'VRU Headform'!Q10)))","v":0},{"$f":"IF(NOT('VRU Headform'!R10=\"Blue\"),IF(OR('VRU Headform'!R10=\"Red\",'VRU Headform'!R10=\"D Red\"),\"Red\",IF(OR('VRU Headform'!R10=\"Green\",'VRU Headform'!R10=\"D Green\"),\"Green\",'VRU Headform'!R10)))","v":0},{"$f":"IF(NOT('VRU Headform'!S10=\"Blue\"),IF(OR('VRU Headform'!S10=\"Red\",'VRU Headform'!S10=\"D Red\"),\"Red\",IF(OR('VRU Headform'!S10=\"Green\",'VRU Headform'!S10=\"D Green\"),\"Green\",'VRU Headform'!S10)))","v":0},{"$f":"IF(NOT('VRU Headform'!T10=\"Blue\"),IF(OR('VRU Headform'!T10=\"Red\",'VRU Headform'!T10=\"D Red\"),\"Red\",IF(OR('VRU Headform'!T10=\"Green\",'VRU Headform'!T10=\"D Green\"),\"Green\",'VRU Headform'!T10)))","v":0},{"$f":"IF(NOT('VRU Headform'!U10=\"Blue\"),IF(OR('VRU Headform'!U10=\"Red\",'VRU Headform'!U10=\"D Red\"),\"Red\",IF(OR('VRU Headform'!U10=\"Green\",'VRU Headform'!U10=\"D Green\"),\"Green\",'VRU Headform'!U10)))","v":0},{"$f":"IF(NOT('VRU Headform'!V10=\"Blue\"),IF(OR('VRU Headform'!V10=\"Red\",'VRU Headform'!V10=\"D Red\"),\"Red\",IF(OR('VRU Headform'!V10=\"Green\",'VRU Headform'!V10=\"D Green\"),\"Green\",'VRU Headform'!V10)))","v":0},{"$f":"IF(NOT('VRU Headform'!W10=\"Blue\"),IF(OR('VRU Headform'!W10=\"Red\",'VRU Headform'!W10=\"D Red\"),\"Red\",IF(OR('VRU Headform'!W10=\"Green\",'VRU Headform'!W10=\"D Green\"),\"Green\",'VRU Headform'!W10)))","v":0},{"$f":"IF(NOT('VRU Headform'!X10=\"Blue\"),IF(OR('VRU Headform'!X10=\"Red\",'VRU Headform'!X10=\"D Red\"),\"Red\",IF(OR('VRU Headform'!X10=\"Green\",'VRU Headform'!X10=\"D Green\"),\"Green\",'VRU Headform'!X10)))","v":0},{"$f":"IF(NOT('VRU Headform'!Y10=\"Blue\"),IF(OR('VRU Headform'!Y10=\"Red\",'VRU Headform'!Y10=\"D Red\"),\"Red\",IF(OR('VRU Headform'!Y10=\"Green\",'VRU Headform'!Y10=\"D Green\"),\"Green\",'VRU Headform'!Y10)))","v":0},{"$f":"IF(C133=$C$126,\"Yes\",\"No\")","v":"No"}]
[null,{"$f":"IF(OR(D128:X146=0),\"COLOUR MISSING\",\"ALL OK\")","v":"COLOUR MISSING"},12,{"$f":"IF(NOT('VRU Headform'!E11=\"Blue\"),IF(OR('VRU Headform'!E11=\"Red\",'VRU Headform'!E11=\"D Red\"),\"Red\",IF(OR('VRU Headform'!E11=\"Green\",'VRU Headform'!E11=\"D Green\"),\"Green\",'VRU Headform'!E11)))","v":0},{"$f":"IF(NOT('VRU Headform'!F11=\"Blue\"),IF(OR('VRU Headform'!F11=\"Red\",'VRU Headform'!F11=\"D Red\"),\"Red\",IF(OR('VRU Headform'!F11=\"Green\",'VRU Headform'!F11=\"D Green\"),\"Green\",'VRU Headform'!F11)))","v":0},{"$f":"IF(NOT('VRU Headform'!G11=\"Blue\"),IF(OR('VRU Headform'!G11=\"Red\",'VRU Headform'!G11=\"D Red\"),\"Red\",IF(OR('VRU Headform'!G11=\"Green\",'VRU Headform'!G11=\"D Green\"),\"Green\",'VRU Headform'!G11)))","v":0},{"$f":"IF(NOT('VRU Headform'!H11=\"Blue\"),IF(OR('VRU Headform'!H11=\"Red\",'VRU Headform'!H11=\"D Red\"),\"Red\",IF(OR('VRU Headform'!H11=\"Green\",'VRU Headform'!H11=\"D Green\"),\"Green\",'VRU Headform'!H11)))","v":0},{"$f":"IF(NOT('VRU Headform'!I11=\"Blue\"),IF(OR('VRU Headform'!I11=\"Red\",'VRU Headform'!I11=\"D Red\"),\"Red\",IF(OR('VRU Headform'!I11=\"Green\",'VRU Headform'!I11=\"D Green\"),\"Green\",'VRU Headform'!I11)))","v":0},{"$f":"IF(NOT('VRU Headform'!J11=\"Blue\"),IF(OR('VRU Headform'!J11=\"Red\",'VRU Headform'!J11=\"D Red\"),\"Red\",IF(OR('VRU Headform'!J11=\"Green\",'VRU Headform'!J11=\"D Green\"),\"Green\",'VRU Headform'!J11)))","v":0},{"$f":"IF(NOT('VRU Headform'!K11=\"Blue\"),IF(OR('VRU Headform'!K11=\"Red\",'VRU Headform'!K11=\"D Red\"),\"Red\",IF(OR('VRU Headform'!K11=\"Green\",'VRU Headform'!K11=\"D Green\"),\"Green\",'VRU Headform'!K11)))","v":0},{"$f":"IF(NOT('VRU Headform'!L11=\"Blue\"),IF(OR('VRU Headform'!L11=\"Red\",'VRU Headform'!L11=\"D Red\"),\"Red\",IF(OR('VRU Headform'!L11=\"Green\",'VRU Headform'!L11=\"D Green\"),\"Green\",'VRU Headform'!L11)))","v":0},{"$f":"IF(NOT('VRU Headform'!M11=\"Blue\"),IF(OR('VRU Headform'!M11=\"Red\",'VRU Headform'!M11=\"D Red\"),\"Red\",IF(OR('VRU Headform'!M11=\"Green\",'VRU Headform'!M11=\"D Green\"),\"Green\",'VRU Headform'!M11)))","v":0},{"$f":"IF(NOT('VRU Headform'!N11=\"Blue\"),IF(OR('VRU Headform'!N11=\"Red\",'VRU Headform'!N11=\"D Red\"),\"Red\",IF(OR('VRU Headform'!N11=\"Green\",'VRU Headform'!N11=\"D Green\"),\"Green\",'VRU Headform'!N11)))","v":0},{"$f":"IF(NOT('VRU Headform'!O11=\"Blue\"),IF(OR('VRU Headform'!O11=\"Red\",'VRU Headform'!O11=\"D Red\"),\"Red\",IF(OR('VRU Headform'!O11=\"Green\",'VRU Headform'!O11=\"D Green\"),\"Green\",'VRU Headform'!O11)))","v":0},{"$f":"IF(NOT('VRU Headform'!P11=\"Blue\"),IF(OR('VRU Headform'!P11=\"Red\",'VRU Headform'!P11=\"D Red\"),\"Red\",IF(OR('VRU Headform'!P11=\"Green\",'VRU Headform'!P11=\"D Green\"),\"Green\",'VRU Headform'!P11)))","v":0},{"$f":"IF(NOT('VRU Headform'!Q11=\"Blue\"),IF(OR('VRU Headform'!Q11=\"Red\",'VRU Headform'!Q11=\"D Red\"),\"Red\",IF(OR('VRU Headform'!Q11=\"Green\",'VRU Headform'!Q11=\"D Green\"),\"Green\",'VRU Headform'!Q11)))","v":0},{"$f":"IF(NOT('VRU Headform'!R11=\"Blue\"),IF(OR('VRU Headform'!R11=\"Red\",'VRU Headform'!R11=\"D Red\"),\"Red\",IF(OR('VRU Headform'!R11=\"Green\",'VRU Headform'!R11=\"D Green\"),\"Green\",'VRU Headform'!R11)))","v":0},{"$f":"IF(NOT('VRU Headform'!S11=\"Blue\"),IF(OR('VRU Headform'!S11=\"Red\",'VRU Headform'!S11=\"D Red\"),\"Red\",IF(OR('VRU Headform'!S11=\"Green\",'VRU Headform'!S11=\"D Green\"),\"Green\",'VRU Headform'!S11)))","v":0},{"$f":"IF(NOT('VRU Headform'!T11=\"Blue\"),IF(OR('VRU Headform'!T11=\"Red\",'VRU Headform'!T11=\"D Red\"),\"Red\",IF(OR('VRU Headform'!T11=\"Green\",'VRU Headform'!T11=\"D Green\"),\"Green\",'VRU Headform'!T11)))","v":0},{"$f":"IF(NOT('VRU Headform'!U11=\"Blue\"),IF(OR('VRU Headform'!U11=\"Red\",'VRU Headform'!U11=\"D Red\"),\"Red\",IF(OR('VRU Headform'!U11=\"Green\",'VRU Headform'!U11=\"D Green\"),\"Green\",'VRU Headform'!U11)))","v":0},{"$f":"IF(NOT('VRU Headform'!V11=\"Blue\"),IF(OR('VRU Headform'!V11=\"Red\",'VRU Headform'!V11=\"D Red\"),\"Red\",IF(OR('VRU Headform'!V11=\"Green\",'VRU Headform'!V11=\"D Green\"),\"Green\",'VRU Headform'!V11)))","v":0},{"$f":"IF(NOT('VRU Headform'!W11=\"Blue\"),IF(OR('VRU Headform'!W11=\"Red\",'VRU Headform'!W11=\"D Red\"),\"Red\",IF(OR('VRU Headform'!W11=\"Green\",'VRU Headform'!W11=\"D Green\"),\"Green\",'VRU Headform'!W11)))","v":0},{"$f":"IF(NOT('VRU Headform'!X11=\"Blue\"),IF(OR('VRU Headform'!X11=\"Red\",'VRU Headform'!X11=\"D Red\"),\"Red\",IF(OR('VRU Headform'!X11=\"Green\",'VRU Headform'!X11=\"D Green\"),\"Green\",'VRU Headform'!X11)))","v":0},{"$f":"IF(NOT('VRU Headform'!Y11=\"Blue\"),IF(OR('VRU Headform'!Y11=\"Red\",'VRU Headform'!Y11=\"D Red\"),\"Red\",IF(OR('VRU Headform'!Y11=\"Green\",'VRU Headform'!Y11=\"D Green\"),\"Green\",'VRU Headform'!Y11)))","v":0},"No"]
[null,null,11,{"$f":"IF(NOT('VRU Headform'!E12=\"Blue\"),IF(OR('VRU Headform'!E12=\"Red\",'VRU Headform'!E12=\"D Red\"),\"Red\",IF(OR('VRU Headform'!E12=\"Green\",'VRU Headform'!E12=\"D Green\"),\"Green\",'VRU Headform'!E12)))","v":0},{"$f":"IF(NOT('VRU Headform'!F12=\"Blue\"),IF(OR('VRU Headform'!F12=\"Red\",'VRU Headform'!F12=\"D Red\"),\"Red\",IF(OR('VRU Headform'!F12=\"Green\",'VRU Headform'!F12=\"D Green\"),\"Green\",'VRU Headform'!F12)))","v":0},{"$f":"IF(NOT('VRU Headform'!G12=\"Blue\"),IF(OR('VRU Headform'!G12=\"Red\",'VRU Headform'!G12=\"D Red\"),\"Red\",IF(OR('VRU Headform'!G12=\"Green\",'VRU Headform'!G12=\"D Green\"),\"Green\",'VRU Headform'!G12)))","v":0},{"$f":"IF(NOT('VRU Headform'!H12=\"Blue\"),IF(OR('VRU Headform'!H12=\"Red\",'VRU Headform'!H12=\"D Red\"),\"Red\",IF(OR('VRU Headform'!H12=\"Green\",'VRU Headform'!H12=\"D Green\"),\"Green\",'VRU Headform'!H12)))","v":0},{"$f":"IF(NOT('VRU Headform'!I12=\"Blue\"),IF(OR('VRU Headform'!I12=\"Red\",'VRU Headform'!I12=\"D Red\"),\"Red\",IF(OR('VRU Headform'!I12=\"Green\",'VRU Headform'!I12=\"D Green\"),\"Green\",'VRU Headform'!I12)))","v":0},{"$f":"IF(NOT('VRU Headform'!J12=\"Blue\"),IF(OR('VRU Headform'!J12=\"Red\",'VRU Headform'!J12=\"D Red\"),\"Red\",IF(OR('VRU Headform'!J12=\"Green\",'VRU Headform'!J12=\"D Green\"),\"Green\",'VRU Headform'!J12)))","v":0},{"$f":"IF(NOT('VRU Headform'!K12=\"Blue\"),IF(OR('VRU Headform'!K12=\"Red\",'VRU Headform'!K12=\"D Red\"),\"Red\",IF(OR('VRU Headform'!K12=\"Green\",'VRU Headform'!K12=\"D Green\"),\"Green\",'VRU Headform'!K12)))","v":0},{"$f":"IF(NOT('VRU Headform'!L12=\"Blue\"),IF(OR('VRU Headform'!L12=\"Red\",'VRU Headform'!L12=\"D Red\"),\"Red\",IF(OR('VRU Headform'!L12=\"Green\",'VRU Headform'!L12=\"D Green\"),\"Green\",'VRU Headform'!L12)))","v":0},{"$f":"IF(NOT('VRU Headform'!M12=\"Blue\"),IF(OR('VRU Headform'!M12=\"Red\",'VRU Headform'!M12=\"D Red\"),\"Red\",IF(OR('VRU Headform'!M12=\"Green\",'VRU Headform'!M12=\"D Green\"),\"Green\",'VRU Headform'!M12)))","v":0},{"$f":"IF(NOT('VRU Headform'!N12=\"Blue\"),IF(OR('VRU Headform'!N12=\"Red\",'VRU Headform'!N12=\"D Red\"),\"Red\",IF(OR('VRU Headform'!N12=\"Green\",'VRU Headform'!N12=\"D Green\"),\"Green\",'VRU Headform'!N12)))","v":0},{"$f":"IF(NOT('VRU Headform'!O12=\"Blue\"),IF(OR('VRU Headform'!O12=\"Red\",'VRU Headform'!O12=\"D Red\"),\"Red\",IF(OR('VRU Headform'!O12=\"Green\",'VRU Headform'!O12=\"D Green\"),\"Green\",'VRU Headform'!O12)))","v":0},{"$f":"IF(NOT('VRU Headform'!P12=\"Blue\"),IF(OR('VRU Headform'!P12=\"Red\",'VRU Headform'!P12=\"D Red\"),\"Red\",IF(OR('VRU Headform'!P12=\"Green\",'VRU Headform'!P12=\"D Green\"),\"Green\",'VRU Headform'!P12)))","v":0},{"$f":"IF(NOT('VRU Headform'!Q12=\"Blue\"),IF(OR('VRU Headform'!Q12=\"Red\",'VRU Headform'!Q12=\"D Red\"),\"Red\",IF(OR('VRU Headform'!Q12=\"Green\",'VRU Headform'!Q12=\"D Green\"),\"Green\",'VRU Headform'!Q12)))","v":0},{"$f":"IF(NOT('VRU Headform'!R12=\"Blue\"),IF(OR('VRU Headform'!R12=\"Red\",'VRU Headform'!R12=\"D Red\"),\"Red\",IF(OR('VRU Headform'!R12=\"Green\",'VRU Headform'!R12=\"D Green\"),\"Green\",'VRU Headform'!R12)))","v":0},{"$f":"IF(NOT('VRU Headform'!S12=\"Blue\"),IF(OR('VRU Headform'!S12=\"Red\",'VRU Headform'!S12=\"D Red\"),\"Red\",IF(OR('VRU Headform'!S12=\"Green\",'VRU Headform'!S12=\"D Green\"),\"Green\",'VRU Headform'!S12)))","v":0},{"$f":"IF(NOT('VRU Headform'!T12=\"Blue\"),IF(OR('VRU Headform'!T12=\"Red\",'VRU Headform'!T12=\"D Red\"),\"Red\",IF(OR('VRU Headform'!T12=\"Green\",'VRU Headform'!T12=\"D Green\"),\"Green\",'VRU Headform'!T12)))","v":0},{"$f":"IF(NOT('VRU Headform'!U12=\"Blue\"),IF(OR('VRU Headform'!U12=\"Red\",'VRU Headform'!U12=\"D Red\"),\"Red\",IF(OR('VRU Headform'!U12=\"Green\",'VRU Headform'!U12=\"D Green\"),\"Green\",'VRU Headform'!U12)))","v":0},{"$f":"IF(NOT('VRU Headform'!V12=\"Blue\"),IF(OR('VRU Headform'!V12=\"Red\",'VRU Headform'!V12=\"D Red\"),\"Red\",IF(OR('VRU Headform'!V12=\"Green\",'VRU Headform'!V12=\"D Green\"),\"Green\",'VRU Headform'!V12)))","v":0},{"$f":"IF(NOT('VRU Headform'!W12=\"Blue\"),IF(OR('VRU Headform'!W12=\"Red\",'VRU Headform'!W12=\"D Red\"),\"Red\",IF(OR('VRU Headform'!W12=\"Green\",'VRU Headform'!W12=\"D Green\"),\"Green\",'VRU Headform'!W12)))","v":0},{"$f":"IF(NOT('VRU Headform'!X12=\"Blue\"),IF(OR('VRU Headform'!X12=\"Red\",'VRU Headform'!X12=\"D Red\"),\"Red\",IF(OR('VRU Headform'!X12=\"Green\",'VRU Headform'!X12=\"D Green\"),\"Green\",'VRU Headform'!X12)))","v":0},{"$f":"IF(NOT('VRU Headform'!Y12=\"Blue\"),IF(OR('VRU Headform'!Y12=\"Red\",'VRU Headform'!Y12=\"D Red\"),\"Red\",IF(OR('VRU Headform'!Y12=\"Green\",'VRU Headform'!Y12=\"D Green\"),\"Green\",'VRU Headform'!Y12)))","v":0},"No"]
[null,null,10,{"$f":"IF(NOT('VRU Headform'!E13=\"Blue\"),IF(OR('VRU Headform'!E13=\"Red\",'VRU Headform'!E13=\"D Red\"),\"Red\",IF(OR('VRU Headform'!E13=\"Green\",'VRU Headform'!E13=\"D Green\"),\"Green\",'VRU Headform'!E13)))","v":0},{"$f":"IF(NOT('VRU Headform'!F13=\"Blue\"),IF(OR('VRU Headform'!F13=\"Red\",'VRU Headform'!F13=\"D Red\"),\"Red\",IF(OR('VRU Headform'!F13=\"Green\",'VRU Headform'!F13=\"D Green\"),\"Green\",'VRU Headform'!F13)))","v":0},{"$f":"IF(NOT('VRU Headform'!G13=\"Blue\"),IF(OR('VRU Headform'!G13=\"Red\",'VRU Headform'!G13=\"D Red\"),\"Red\",IF(OR('VRU Headform'!G13=\"Green\",'VRU Headform'!G13=\"D Green\"),\"Green\",'VRU Headform'!G13)))","v":0},{"$f":"IF(NOT('VRU Headform'!H13=\"Blue\"),IF(OR('VRU Headform'!H13=\"Red\",'VRU Headform'!H13=\"D Red\"),\"Red\",IF(OR('VRU Headform'!H13=\"Green\",'VRU Headform'!H13=\"D Green\"),\"Green\",'VRU Headform'!H13)))","v":0},{"$f":"IF(NOT('VRU Headform'!I13=\"Blue\"),IF(OR('VRU Headform'!I13=\"Red\",'VRU Headform'!I13=\"D Red\"),\"Red\",IF(OR('VRU Headform'!I13=\"Green\",'VRU Headform'!I13=\"D Green\"),\"Green\",'VRU Headform'!I13)))","v":0},{"$f":"IF(NOT('VRU Headform'!J13=\"Blue\"),IF(OR('VRU Headform'!J13=\"Red\",'VRU Headform'!J13=\"D Red\"),\"Red\",IF(OR('VRU Headform'!J13=\"Green\",'VRU Headform'!J13=\"D Green\"),\"Green\",'VRU Headform'!J13)))","v":0},{"$f":"IF(NOT('VRU Headform'!K13=\"Blue\"),IF(OR('VRU Headform'!K13=\"Red\",'VRU Headform'!K13=\"D Red\"),\"Red\",IF(OR('VRU Headform'!K13=\"Green\",'VRU Headform'!K13=\"D Green\"),\"Green\",'VRU Headform'!K13)))","v":0},{"$f":"IF(NOT('VRU Headform'!L13=\"Blue\"),IF(OR('VRU Headform'!L13=\"Red\",'VRU Headform'!L13=\"D Red\"),\"Red\",IF(OR('VRU Headform'!L13=\"Green\",'VRU Headform'!L13=\"D Green\"),\"Green\",'VRU Headform'!L13)))","v":0},{"$f":"IF(NOT('VRU Headform'!M13=\"Blue\"),IF(OR('VRU Headform'!M13=\"Red\",'VRU Headform'!M13=\"D Red\"),\"Red\",IF(OR('VRU Headform'!M13=\"Green\",'VRU Headform'!M13=\"D Green\"),\"Green\",'VRU Headform'!M13)))","v":0},{"$f":"IF(NOT('VRU Headform'!N13=\"Blue\"),IF(OR('VRU Headform'!N13=\"Red\",'VRU Headform'!N13=\"D Red\"),\"Red\",IF(OR('VRU Headform'!N13=\"Green\",'VRU Headform'!N13=\"D Green\"),\"Green\",'VRU Headform'!N13)))","v":0},{"$f":"IF(NOT('VRU Headform'!O13=\"Blue\"),IF(OR('VRU Headform'!O13=\"Red\",'VRU Headform'!O13=\"D Red\"),\"Red\",IF(OR('VRU Headform'!O13=\"Green\",'VRU Headform'!O13=\"D Green\"),\"Green\",'VRU Headform'!O13)))","v":0},{"$f":"IF(NOT('VRU Headform'!P13=\"Blue\"),IF(OR('VRU Headform'!P13=\"Red\",'VRU Headform'!P13=\"D Red\"),\"Red\",IF(OR('VRU Headform'!P13=\"Green\",'VRU Headform'!P13=\"D Green\"),\"Green\",'VRU Headform'!P13)))","v":0},{"$f":"IF(NOT('VRU Headform'!Q13=\"Blue\"),IF(OR('VRU Headform'!Q13=\"Red\",'VRU Headform'!Q13=\"D Red\"),\"Red\",IF(OR('VRU Headform'!Q13=\"Green\",'VRU Headform'!Q13=\"D Green\"),\"Green\",'VRU Headform'!Q13)))","v":0},{"$f":"IF(NOT('VRU Headform'!R13=\"Blue\"),IF(OR('VRU Headform'!R13=\"Red\",'VRU Headform'!R13=\"D Red\"),\"Red\",IF(OR('VRU Headform'!R13=\"Green\",'VRU Headform'!R13=\"D Green\"),\"Green\",'VRU Headform'!R13)))","v":0},{"$f":"IF(NOT('VRU Headform'!S13=\"Blue\"),IF(OR('VRU Headform'!S13=\"Red\",'VRU Headform'!S13=\"D Red\"),\"Red\",IF(OR('VRU Headform'!S13=\"Green\",'VRU Headform'!S13=\"D Green\"),\"Green\",'VRU Headform'!S13)))","v":0},{"$f":"IF(NOT('VRU Headform'!T13=\"Blue\"),IF(OR('VRU Headform'!T13=\"Red\",'VRU Headform'!T13=\"D Red\"),\"Red\",IF(OR('VRU Headform'!T13=\"Green\",'VRU Headform'!T13=\"D Green\"),\"Green\",'VRU Headform'!T13)))","v":0},{"$f":"IF(NOT('VRU Headform'!U13=\"Blue\"),IF(OR('VRU Headform'!U13=\"Red\",'VRU Headform'!U13=\"D Red\"),\"Red\",IF(OR('VRU Headform'!U13=\"Green\",'VRU Headform'!U13=\"D Green\"),\"Green\",'VRU Headform'!U13)))","v":0},{"$f":"IF(NOT('VRU Headform'!V13=\"Blue\"),IF(OR('VRU Headform'!V13=\"Red\",'VRU Headform'!V13=\"D Red\"),\"Red\",IF(OR('VRU Headform'!V13=\"Green\",'VRU Headform'!V13=\"D Green\"),\"Green\",'VRU Headform'!V13)))","v":0},{"$f":"IF(NOT('VRU Headform'!W13=\"Blue\"),IF(OR('VRU Headform'!W13=\"Red\",'VRU Headform'!W13=\"D Red\"),\"Red\",IF(OR('VRU Headform'!W13=\"Green\",'VRU Headform'!W13=\"D Green\"),\"Green\",'VRU Headform'!W13)))","v":0},{"$f":"IF(NOT('VRU Headform'!X13=\"Blue\"),IF(OR('VRU Headform'!X13=\"Red\",'VRU Headform'!X13=\"D Red\"),\"Red\",IF(OR('VRU Headform'!X13=\"Green\",'VRU Headform'!X13=\"D Green\"),\"Green\",'VRU Headform'!X13)))","v":0},{"$f":"IF(NOT('VRU Headform'!Y13=\"Blue\"),IF(OR('VRU Headform'!Y13=\"Red\",'VRU Headform'!Y13=\"D Red\"),\"Red\",IF(OR('VRU Headform'!Y13=\"Green\",'VRU Headform'!Y13=\"D Green\"),\"Green\",'VRU Headform'!Y13)))","v":0},"No"]
[null,null,9,{"$f":"IF(NOT('VRU Headform'!E14=\"Blue\"),IF(OR('VRU Headform'!E14=\"Red\",'VRU Headform'!E14=\"D Red\"),\"Red\",IF(OR('VRU Headform'!E14=\"Green\",'VRU Headform'!E14=\"D Green\"),\"Green\",'VRU Headform'!E14)))","v":0},{"$f":"IF(NOT('VRU Headform'!F14=\"Blue\"),IF(OR('VRU Headform'!F14=\"Red\",'VRU Headform'!F14=\"D Red\"),\"Red\",IF(OR('VRU Headform'!F14=\"Green\",'VRU Headform'!F14=\"D Green\"),\"Green\",'VRU Headform'!F14)))","v":0},{"$f":"IF(NOT('VRU Headform'!G14=\"Blue\"),IF(OR('VRU Headform'!G14=\"Red\",'VRU Headform'!G14=\"D Red\"),\"Red\",IF(OR('VRU Headform'!G14=\"Green\",'VRU Headform'!G14=\"D Green\"),\"Green\",'VRU Headform'!G14)))","v":0},{"$f":"IF(NOT('VRU Headform'!H14=\"Blue\"),IF(OR('VRU Headform'!H14=\"Red\",'VRU Headform'!H14=\"D Red\"),\"Red\",IF(OR('VRU Headform'!H14=\"Green\",'VRU Headform'!H14=\"D Green\"),\"Green\",'VRU Headform'!H14)))","v":0},{"$f":"IF(NOT('VRU Headform'!I14=\"Blue\"),IF(OR('VRU Headform'!I14=\"Red\",'VRU Headform'!I14=\"D Red\"),\"Red\",IF(OR('VRU Headform'!I14=\"Green\",'VRU Headform'!I14=\"D Green\"),\"Green\",'VRU Headform'!I14)))","v":0},{"$f":"IF(NOT('VRU Headform'!J14=\"Blue\"),IF(OR('VRU Headform'!J14=\"Red\",'VRU Headform'!J14=\"D Red\"),\"Red\",IF(OR('VRU Headform'!J14=\"Green\",'VRU Headform'!J14=\"D Green\"),\"Green\",'VRU Headform'!J14)))","v":0},{"$f":"IF(NOT('VRU Headform'!K14=\"Blue\"),IF(OR('VRU Headform'!K14=\"Red\",'VRU Headform'!K14=\"D Red\"),\"Red\",IF(OR('VRU Headform'!K14=\"Green\",'VRU Headform'!K14=\"D Green\"),\"Green\",'VRU Headform'!K14)))","v":0},{"$f":"IF(NOT('VRU Headform'!L14=\"Blue\"),IF(OR('VRU Headform'!L14=\"Red\",'VRU Headform'!L14=\"D Red\"),\"Red\",IF(OR('VRU Headform'!L14=\"Green\",'VRU Headform'!L14=\"D Green\"),\"Green\",'VRU Headform'!L14)))","v":0},{"$f":"IF(NOT('VRU Headform'!M14=\"Blue\"),IF(OR('VRU Headform'!M14=\"Red\",'VRU Headform'!M14=\"D Red\"),\"Red\",IF(OR('VRU Headform'!M14=\"Green\",'VRU Headform'!M14=\"D Green\"),\"Green\",'VRU Headform'!M14)))","v":0},{"$f":"IF(NOT('VRU Headform'!N14=\"Blue\"),IF(OR('VRU Headform'!N14=\"Red\",'VRU Headform'!N14=\"D Red\"),\"Red\",IF(OR('VRU Headform'!N14=\"Green\",'VRU Headform'!N14=\"D Green\"),\"Green\",'VRU Headform'!N14)))","v":0},{"$f":"IF(NOT('VRU Headform'!O14=\"Blue\"),IF(OR('VRU Headform'!O14=\"Red\",'VRU Headform'!O14=\"D Red\"),\"Red\",IF(OR('VRU Headform'!O14=\"Green\",'VRU Headform'!O14=\"D Green\"),\"Green\",'VRU Headform'!O14)))","v":0},{"$f":"IF(NOT('VRU Headform'!P14=\"Blue\"),IF(OR('VRU Headform'!P14=\"Red\",'VRU Headform'!P14=\"D Red\"),\"Red\",IF(OR('VRU Headform'!P14=\"Green\",'VRU Headform'!P14=\"D Green\"),\"Green\",'VRU Headform'!P14)))","v":0},{"$f":"IF(NOT('VRU Headform'!Q14=\"Blue\"),IF(OR('VRU Headform'!Q14=\"Red\",'VRU Headform'!Q14=\"D Red\"),\"Red\",IF(OR('VRU Headform'!Q14=\"Green\",'VRU Headform'!Q14=\"D Green\"),\"Green\",'VRU Headform'!Q14)))","v":0},{"$f":"IF(NOT('VRU Headform'!R14=\"Blue\"),IF(OR('VRU Headform'!R14=\"Red\",'VRU Headform'!R14=\"D Red\"),\"Red\",IF(OR('VRU Headform'!R14=\"Green\",'VRU Headform'!R14=\"D Green\"),\"Green\",'VRU Headform'!R14)))","v":0},{"$f":"IF(NOT('VRU Headform'!S14=\"Blue\"),IF(OR('VRU Headform'!S14=\"Red\",'VRU Headform'!S14=\"D Red\"),\"Red\",IF(OR('VRU Headform'!S14=\"Green\",'VRU Headform'!S14=\"D Green\"),\"Green\",'VRU Headform'!S14)))","v":0},{"$f":"IF(NOT('VRU Headform'!T14=\"Blue\"),IF(OR('VRU Headform'!T14=\"Red\",'VRU Headform'!T14=\"D Red\"),\"Red\",IF(OR('VRU Headform'!T14=\"Green\",'VRU Headform'!T14=\"D Green\"),\"Green\",'VRU Headform'!T14)))","v":0},{"$f":"IF(NOT('VRU Headform'!U14=\"Blue\"),IF(OR('VRU Headform'!U14=\"Red\",'VRU Headform'!U14=\"D Red\"),\"Red\",IF(OR('VRU Headform'!U14=\"Green\",'VRU Headform'!U14=\"D Green\"),\"Green\",'VRU Headform'!U14)))","v":0},{"$f":"IF(NOT('VRU Headform'!V14=\"Blue\"),IF(OR('VRU Headform'!V14=\"Red\",'VRU Headform'!V14=\"D Red\"),\"Red\",IF(OR('VRU Headform'!V14=\"Green\",'VRU Headform'!V14=\"D Green\"),\"Green\",'VRU Headform'!V14)))","v":0},{"$f":"IF(NOT('VRU Headform'!W14=\"Blue\"),IF(OR('VRU Headform'!W14=\"Red\",'VRU Headform'!W14=\"D Red\"),\"Red\",IF(OR('VRU Headform'!W14=\"Green\",'VRU Headform'!W14=\"D Green\"),\"Green\",'VRU Headform'!W14)))","v":0},{"$f":"IF(NOT('VRU Headform'!X14=\"Blue\"),IF(OR('VRU Headform'!X14=\"Red\",'VRU Headform'!X14=\"D Red\"),\"Red\",IF(OR('VRU Headform'!X14=\"Green\",'VRU Headform'!X14=\"D Green\"),\"Green\",'VRU Headform'!X14)))","v":0},{"$f":"IF(NOT('VRU Headform'!Y14=\"Blue\"),IF(OR('VRU Headform'!Y14=\"Red\",'VRU Headform'!Y14=\"D Red\"),\"Red\",IF(OR('VRU Headform'!Y14=\"Green\",'VRU Headform'!Y14=\"D Green\"),\"Green\",'VRU Headform'!Y14)))","v":0},"No"]
[null,null,8,{"$f":"IF(NOT('VRU Headform'!E15=\"Blue\"),IF(OR('VRU Headform'!E15=\"Red\",'VRU Headform'!E15=\"D Red\"),\"Red\",IF(OR('VRU Headform'!E15=\"Green\",'VRU Headform'!E15=\"D Green\"),\"Green\",'VRU Headform'!E15)))","v":0},{"$f":"IF(NOT('VRU Headform'!F15=\"Blue\"),IF(OR('VRU Headform'!F15=\"Red\",'VRU Headform'!F15=\"D Red\"),\"Red\",IF(OR('VRU Headform'!F15=\"Green\",'VRU Headform'!F15=\"D Green\"),\"Green\",'VRU Headform'!F15)))","v":0},{"$f":"IF(NOT('VRU Headform'!G15=\"Blue\"),IF(OR('VRU Headform'!G15=\"Red\",'VRU Headform'!G15=\"D Red\"),\"Red\",IF(OR('VRU Headform'!G15=\"Green\",'VRU Headform'!G15=\"D Green\"),\"Green\",'VRU Headform'!G15)))","v":0},{"$f":"IF(NOT('VRU Headform'!H15=\"Blue\"),IF(OR('VRU Headform'!H15=\"Red\",'VRU Headform'!H15=\"D Red\"),\"Red\",IF(OR('VRU Headform'!H15=\"Green\",'VRU Headform'!H15=\"D Green\"),\"Green\",'VRU Headform'!H15)))","v":0},{"$f":"IF(NOT('VRU Headform'!I15=\"Blue\"),IF(OR('VRU Headform'!I15=\"Red\",'VRU Headform'!I15=\"D Red\"),\"Red\",IF(OR('VRU Headform'!I15=\"Green\",'VRU Headform'!I15=\"D Green\"),\"Green\",'VRU Headform'!I15)))","v":0},{"$f":"IF(NOT('VRU Headform'!J15=\"Blue\"),IF(OR('VRU Headform'!J15=\"Red\",'VRU Headform'!J15=\"D Red\"),\"Red\",IF(OR('VRU Headform'!J15=\"Green\",'VRU Headform'!J15=\"D Green\"),\"Green\",'VRU Headform'!J15)))","v":0},{"$f":"IF(NOT('VRU Headform'!K15=\"Blue\"),IF(OR('VRU Headform'!K15=\"Red\",'VRU Headform'!K15=\"D Red\"),\"Red\",IF(OR('VRU Headform'!K15=\"Green\",'VRU Headform'!K15=\"D Green\"),\"Green\",'VRU Headform'!K15)))","v":0},{"$f":"IF(NOT('VRU Headform'!L15=\"Blue\"),IF(OR('VRU Headform'!L15=\"Red\",'VRU Headform'!L15=\"D Red\"),\"Red\",IF(OR('VRU Headform'!L15=\"Green\",'VRU Headform'!L15=\"D Green\"),\"Green\",'VRU Headform'!L15)))","v":0},{"$f":"IF(NOT('VRU Headform'!M15=\"Blue\"),IF(OR('VRU Headform'!M15=\"Red\",'VRU Headform'!M15=\"D Red\"),\"Red\",IF(OR('VRU Headform'!M15=\"Green\",'VRU Headform'!M15=\"D Green\"),\"Green\",'VRU Headform'!M15)))","v":0},{"$f":"IF(NOT('VRU Headform'!N15=\"Blue\"),IF(OR('VRU Headform'!N15=\"Red\",'VRU Headform'!N15=\"D Red\"),\"Red\",IF(OR('VRU Headform'!N15=\"Green\",'VRU Headform'!N15=\"D Green\"),\"Green\",'VRU Headform'!N15)))","v":0},{"$f":"IF(NOT('VRU Headform'!O15=\"Blue\"),IF(OR('VRU Headform'!O15=\"Red\",'VRU Headform'!O15=\"D Red\"),\"Red\",IF(OR('VRU Headform'!O15=\"Green\",'VRU Headform'!O15=\"D Green\"),\"Green\",'VRU Headform'!O15)))","v":0},{"$f":"IF(NOT('VRU Headform'!P15=\"Blue\"),IF(OR('VRU Headform'!P15=\"Red\",'VRU Headform'!P15=\"D Red\"),\"Red\",IF(OR('VRU Headform'!P15=\"Green\",'VRU Headform'!P15=\"D Green\"),\"Green\",'VRU Headform'!P15)))","v":0},{"$f":"IF(NOT('VRU Headform'!Q15=\"Blue\"),IF(OR('VRU Headform'!Q15=\"Red\",'VRU Headform'!Q15=\"D Red\"),\"Red\",IF(OR('VRU Headform'!Q15=\"Green\",'VRU Headform'!Q15=\"D Green\"),\"Green\",'VRU Headform'!Q15)))","v":0},{"$f":"IF(NOT('VRU Headform'!R15=\"Blue\"),IF(OR('VRU Headform'!R15=\"Red\",'VRU Headform'!R15=\"D Red\"),\"Red\",IF(OR('VRU Headform'!R15=\"Green\",'VRU Headform'!R15=\"D Green\"),\"Green\",'VRU Headform'!R15)))","v":0},{"$f":"IF(NOT('VRU Headform'!S15=\"Blue\"),IF(OR('VRU Headform'!S15=\"Red\",'VRU Headform'!S15=\"D Red\"),\"Red\",IF(OR('VRU Headform'!S15=\"Green\",'VRU Headform'!S15=\"D Green\"),\"Green\",'VRU Headform'!S15)))","v":0},{"$f":"IF(NOT('VRU Headform'!T15=\"Blue\"),IF(OR('VRU Headform'!T15=\"Red\",'VRU Headform'!T15=\"D Red\"),\"Red\",IF(OR('VRU Headform'!T15=\"Green\",'VRU Headform'!T15=\"D Green\"),\"Green\",'VRU Headform'!T15)))","v":0},{"$f":"IF(NOT('VRU Headform'!U15=\"Blue\"),IF(OR('VRU Headform'!U15=\"Red\",'VRU Headform'!U15=\"D Red\"),\"Red\",IF(OR('VRU Headform'!U15=\"Green\",'VRU Headform'!U15=\"D Green\"),\"Green\",'VRU Headform'!U15)))","v":0},{"$f":"IF(NOT('VRU Headform'!V15=\"Blue\"),IF(OR('VRU Headform'!V15=\"Red\",'VRU Headform'!V15=\"D Red\"),\"Red\",IF(OR('VRU Headform'!V15=\"Green\",'VRU Headform'!V15=\"D Green\"),\"Green\",'VRU Headform'!V15)))","v":0},{"$f":"IF(NOT('VRU Headform'!W15=\"Blue\"),IF(OR('VRU Headform'!W15=\"Red\",'VRU Headform'!W15=\"D Red\"),\"Red\",IF(OR('VRU Headform'!W15=\"Green\",'VRU Headform'!W15=\"D Green\"),\"Green\",'VRU Headform'!W15)))","v":0},{"$f":"IF(NOT('VRU Headform'!X15=\"Blue\"),IF(OR('VRU Headform'!X15=\"Red\",'VRU Headform'!X15=\"D Red\"),\"Red\",IF(OR('VRU Headform'!X15=\"Green\",'VRU Headform'!X15=\"D Green\"),\"Green\",'VRU Headform'!X15)))","v":0},{"$f":"IF(NOT('VRU Headform'!Y15=\"Blue\"),IF(OR('VRU Headform'!Y15=\"Red\",'VRU Headform'!Y15=\"D Red\"),\"Red\",IF(OR('VRU Headform'!Y15=\"Green\",'VRU Headform'!Y15=\"D Green\"),\"Green\",'VRU Headform'!Y15)))","v":0},"No"]
[null,null,7,{"$f":"IF(NOT('VRU Headform'!E16=\"Blue\"),IF(OR('VRU Headform'!E16=\"Red\",'VRU Headform'!E16=\"D Red\"),\"Red\",IF(OR('VRU Headform'!E16=\"Green\",'VRU Headform'!E16=\"D Green\"),\"Green\",'VRU Headform'!E16)))","v":0},{"$f":"IF(NOT('VRU Headform'!F16=\"Blue\"),IF(OR('VRU Headform'!F16=\"Red\",'VRU Headform'!F16=\"D Red\"),\"Red\",IF(OR('VRU Headform'!F16=\"Green\",'VRU Headform'!F16=\"D Green\"),\"Green\",'VRU Headform'!F16)))","v":0},{"$f":"IF(NOT('VRU Headform'!G16=\"Blue\"),IF(OR('VRU Headform'!G16=\"Red\",'VRU Headform'!G16=\"D Red\"),\"Red\",IF(OR('VRU Headform'!G16=\"Green\",'VRU Headform'!G16=\"D Green\"),\"Green\",'VRU Headform'!G16)))","v":0},{"$f":"IF(NOT('VRU Headform'!H16=\"Blue\"),IF(OR('VRU Headform'!H16=\"Red\",'VRU Headform'!H16=\"D Red\"),\"Red\",IF(OR('VRU Headform'!H16=\"Green\",'VRU Headform'!H16=\"D Green\"),\"Green\",'VRU Headform'!H16)))","v":0},{"$f":"IF(NOT('VRU Headform'!I16=\"Blue\"),IF(OR('VRU Headform'!I16=\"Red\",'VRU Headform'!I16=\"D Red\"),\"Red\",IF(OR('VRU Headform'!I16=\"Green\",'VRU Headform'!I16=\"D Green\"),\"Green\",'VRU Headform'!I16)))","v":0},{"$f":"IF(NOT('VRU Headform'!J16=\"Blue\"),IF(OR('VRU Headform'!J16=\"Red\",'VRU Headform'!J16=\"D Red\"),\"Red\",IF(OR('VRU Headform'!J16=\"Green\",'VRU Headform'!J16=\"D Green\"),\"Green\",'VRU Headform'!J16)))","v":0},{"$f":"IF(NOT('VRU Headform'!K16=\"Blue\"),IF(OR('VRU Headform'!K16=\"Red\",'VRU Headform'!K16=\"D Red\"),\"Red\",IF(OR('VRU Headform'!K16=\"Green\",'VRU Headform'!K16=\"D Green\"),\"Green\",'VRU Headform'!K16)))","v":0},{"$f":"IF(NOT('VRU Headform'!L16=\"Blue\"),IF(OR('VRU Headform'!L16=\"Red\",'VRU Headform'!L16=\"D Red\"),\"Red\",IF(OR('VRU Headform'!L16=\"Green\",'VRU Headform'!L16=\"D Green\"),\"Green\",'VRU Headform'!L16)))","v":0},{"$f":"IF(NOT('VRU Headform'!M16=\"Blue\"),IF(OR('VRU Headform'!M16=\"Red\",'VRU Headform'!M16=\"D Red\"),\"Red\",IF(OR('VRU Headform'!M16=\"Green\",'VRU Headform'!M16=\"D Green\"),\"Green\",'VRU Headform'!M16)))","v":0},{"$f":"IF(NOT('VRU Headform'!N16=\"Blue\"),IF(OR('VRU Headform'!N16=\"Red\",'VRU Headform'!N16=\"D Red\"),\"Red\",IF(OR('VRU Headform'!N16=\"Green\",'VRU Headform'!N16=\"D Green\"),\"Green\",'VRU Headform'!N16)))","v":0},{"$f":"IF(NOT('VRU Headform'!O16=\"Blue\"),IF(OR('VRU Headform'!O16=\"Red\",'VRU Headform'!O16=\"D Red\"),\"Red\",IF(OR('VRU Headform'!O16=\"Green\",'VRU Headform'!O16=\"D Green\"),\"Green\",'VRU Headform'!O16)))","v":0},{"$f":"IF(NOT('VRU Headform'!P16=\"Blue\"),IF(OR('VRU Headform'!P16=\"Red\",'VRU Headform'!P16=\"D Red\"),\"Red\",IF(OR('VRU Headform'!P16=\"Green\",'VRU Headform'!P16=\"D Green\"),\"Green\",'VRU Headform'!P16)))","v":0},{"$f":"IF(NOT('VRU Headform'!Q16=\"Blue\"),IF(OR('VRU Headform'!Q16=\"Red\",'VRU Headform'!Q16=\"D Red\"),\"Red\",IF(OR('VRU Headform'!Q16=\"Green\",'VRU Headform'!Q16=\"D Green\"),\"Green\",'VRU Headform'!Q16)))","v":0},{"$f":"IF(NOT('VRU Headform'!R16=\"Blue\"),IF(OR('VRU Headform'!R16=\"Red\",'VRU Headform'!R16=\"D Red\"),\"Red\",IF(OR('VRU Headform'!R16=\"Green\",'VRU Headform'!R16=\"D Green\"),\"Green\",'VRU Headform'!R16)))","v":0},{"$f":"IF(NOT('VRU Headform'!S16=\"Blue\"),IF(OR('VRU Headform'!S16=\"Red\",'VRU Headform'!S16=\"D Red\"),\"Red\",IF(OR('VRU Headform'!S16=\"Green\",'VRU Headform'!S16=\"D Green\"),\"Green\",'VRU Headform'!S16)))","v":0},{"$f":"IF(NOT('VRU Headform'!T16=\"Blue\"),IF(OR('VRU Headform'!T16=\"Red\",'VRU Headform'!T16=\"D Red\"),\"Red\",IF(OR('VRU Headform'!T16=\"Green\",'VRU Headform'!T16=\"D Green\"),\"Green\",'VRU Headform'!T16)))","v":0},{"$f":"IF(NOT('VRU Headform'!U16=\"Blue\"),IF(OR('VRU Headform'!U16=\"Red\",'VRU Headform'!U16=\"D Red\"),\"Red\",IF(OR('VRU Headform'!U16=\"Green\",'VRU Headform'!U16=\"D Green\"),\"Green\",'VRU Headform'!U16)))","v":0},{"$f":"IF(NOT('VRU Headform'!V16=\"Blue\"),IF(OR('VRU Headform'!V16=\"Red\",'VRU Headform'!V16=\"D Red\"),\"Red\",IF(OR('VRU Headform'!V16=\"Green\",'VRU Headform'!V16=\"D Green\"),\"Green\",'VRU Headform'!V16)))","v":0},{"$f":"IF(NOT('VRU Headform'!W16=\"Blue\"),IF(OR('VRU Headform'!W16=\"Red\",'VRU Headform'!W16=\"D Red\"),\"Red\",IF(OR('VRU Headform'!W16=\"Green\",'VRU Headform'!W16=\"D Green\"),\"Green\",'VRU Headform'!W16)))","v":0},{"$f":"IF(NOT('VRU Headform'!X16=\"Blue\"),IF(OR('VRU Headform'!X16=\"Red\",'VRU Headform'!X16=\"D Red\"),\"Red\",IF(OR('VRU Headform'!X16=\"Green\",'VRU Headform'!X16=\"D Green\"),\"Green\",'VRU Headform'!X16)))","v":0},{"$f":"IF(NOT('VRU Headform'!Y16=\"Blue\"),IF(OR('VRU Headform'!Y16=\"Red\",'VRU Headform'!Y16=\"D Red\"),\"Red\",IF(OR('VRU Headform'!Y16=\"Green\",'VRU Headform'!Y16=\"D Green\"),\"Green\",'VRU Headform'!Y16)))","v":0},"No"]
[null,null,6,{"$f":"IF(NOT('VRU Headform'!E17=\"Blue\"),IF(OR('VRU Headform'!E17=\"Red\",'VRU Headform'!E17=\"D Red\"),\"Red\",IF(OR('VRU Headform'!E17=\"Green\",'VRU Headform'!E17=\"D Green\"),\"Green\",'VRU Headform'!E17)))","v":0},{"$f":"IF(NOT('VRU Headform'!F17=\"Blue\"),IF(OR('VRU Headform'!F17=\"Red\",'VRU Headform'!F17=\"D Red\"),\"Red\",IF(OR('VRU Headform'!F17=\"Green\",'VRU Headform'!F17=\"D Green\"),\"Green\",'VRU Headform'!F17)))","v":0},{"$f":"IF(NOT('VRU Headform'!G17=\"Blue\"),IF(OR('VRU Headform'!G17=\"Red\",'VRU Headform'!G17=\"D Red\"),\"Red\",IF(OR('VRU Headform'!G17=\"Green\",'VRU Headform'!G17=\"D Green\"),\"Green\",'VRU Headform'!G17)))","v":0},{"$f":"IF(NOT('VRU Headform'!H17=\"Blue\"),IF(OR('VRU Headform'!H17=\"Red\",'VRU Headform'!H17=\"D Red\"),\"Red\",IF(OR('VRU Headform'!H17=\"Green\",'VRU Headform'!H17=\"D Green\"),\"Green\",'VRU Headform'!H17)))","v":0},{"$f":"IF(NOT('VRU Headform'!I17=\"Blue\"),IF(OR('VRU Headform'!I17=\"Red\",'VRU Headform'!I17=\"D Red\"),\"Red\",IF(OR('VRU Headform'!I17=\"Green\",'VRU Headform'!I17=\"D Green\"),\"Green\",'VRU Headform'!I17)))","v":0},{"$f":"IF(NOT('VRU Headform'!J17=\"Blue\"),IF(OR('VRU Headform'!J17=\"Red\",'VRU Headform'!J17=\"D Red\"),\"Red\",IF(OR('VRU Headform'!J17=\"Green\",'VRU Headform'!J17=\"D Green\"),\"Green\",'VRU Headform'!J17)))","v":0},{"$f":"IF(NOT('VRU Headform'!K17=\"Blue\"),IF(OR('VRU Headform'!K17=\"Red\",'VRU Headform'!K17=\"D Red\"),\"Red\",IF(OR('VRU Headform'!K17=\"Green\",'VRU Headform'!K17=\"D Green\"),\"Green\",'VRU Headform'!K17)))","v":0},{"$f":"IF(NOT('VRU Headform'!L17=\"Blue\"),IF(OR('VRU Headform'!L17=\"Red\",'VRU Headform'!L17=\"D Red\"),\"Red\",IF(OR('VRU Headform'!L17=\"Green\",'VRU Headform'!L17=\"D Green\"),\"Green\",'VRU Headform'!L17)))","v":0},{"$f":"IF(NOT('VRU Headform'!M17=\"Blue\"),IF(OR('VRU Headform'!M17=\"Red\",'VRU Headform'!M17=\"D Red\"),\"Red\",IF(OR('VRU Headform'!M17=\"Green\",'VRU Headform'!M17=\"D Green\"),\"Green\",'VRU Headform'!M17)))","v":0},{"$f":"IF(NOT('VRU Headform'!N17=\"Blue\"),IF(OR('VRU Headform'!N17=\"Red\",'VRU Headform'!N17=\"D Red\"),\"Red\",IF(OR('VRU Headform'!N17=\"Green\",'VRU Headform'!N17=\"D Green\"),\"Green\",'VRU Headform'!N17)))","v":0},{"$f":"IF(NOT('VRU Headform'!O17=\"Blue\"),IF(OR('VRU Headform'!O17=\"Red\",'VRU Headform'!O17=\"D Red\"),\"Red\",IF(OR('VRU Headform'!O17=\"Green\",'VRU Headform'!O17=\"D Green\"),\"Green\",'VRU Headform'!O17)))","v":0},{"$f":"IF(NOT('VRU Headform'!P17=\"Blue\"),IF(OR('VRU Headform'!P17=\"Red\",'VRU Headform'!P17=\"D Red\"),\"Red\",IF(OR('VRU Headform'!P17=\"Green\",'VRU Headform'!P17=\"D Green\"),\"Green\",'VRU Headform'!P17)))","v":0},{"$f":"IF(NOT('VRU Headform'!Q17=\"Blue\"),IF(OR('VRU Headform'!Q17=\"Red\",'VRU Headform'!Q17=\"D Red\"),\"Red\",IF(OR('VRU Headform'!Q17=\"Green\",'VRU Headform'!Q17=\"D Green\"),\"Green\",'VRU Headform'!Q17)))","v":0},{"$f":"IF(NOT('VRU Headform'!R17=\"Blue\"),IF(OR('VRU Headform'!R17=\"Red\",'VRU Headform'!R17=\"D Red\"),\"Red\",IF(OR('VRU Headform'!R17=\"Green\",'VRU Headform'!R17=\"D Green\"),\"Green\",'VRU Headform'!R17)))","v":0},{"$f":"IF(NOT('VRU Headform'!S17=\"Blue\"),IF(OR('VRU Headform'!S17=\"Red\",'VRU Headform'!S17=\"D Red\"),\"Red\",IF(OR('VRU Headform'!S17=\"Green\",'VRU Headform'!S17=\"D Green\"),\"Green\",'VRU Headform'!S17)))","v":0},{"$f":"IF(NOT('VRU Headform'!T17=\"Blue\"),IF(OR('VRU Headform'!T17=\"Red\",'VRU Headform'!T17=\"D Red\"),\"Red\",IF(OR('VRU Headform'!T17=\"Green\",'VRU Headform'!T17=\"D Green\"),\"Green\",'VRU Headform'!T17)))","v":0},{"$f":"IF(NOT('VRU Headform'!U17=\"Blue\"),IF(OR('VRU Headform'!U17=\"Red\",'VRU Headform'!U17=\"D Red\"),\"Red\",IF(OR('VRU Headform'!U17=\"Green\",'VRU Headform'!U17=\"D Green\"),\"Green\",'VRU Headform'!U17)))","v":0},{"$f":"IF(NOT('VRU Headform'!V17=\"Blue\"),IF(OR('VRU Headform'!V17=\"Red\",'VRU Headform'!V17=\"D Red\"),\"Red\",IF(OR('VRU Headform'!V17=\"Green\",'VRU Headform'!V17=\"D Green\"),\"Green\",'VRU Headform'!V17)))","v":0},{"$f":"IF(NOT('VRU Headform'!W17=\"Blue\"),IF(OR('VRU Headform'!W17=\"Red\",'VRU Headform'!W17=\"D Red\"),\"Red\",IF(OR('VRU Headform'!W17=\"Green\",'VRU Headform'!W17=\"D Green\"),\"Green\",'VRU Headform'!W17)))","v":0},{"$f":"IF(NOT('VRU Headform'!X17=\"Blue\"),IF(OR('VRU Headform'!X17=\"Red\",'VRU Headform'!X17=\"D Red\"),\"Red\",IF(OR('VRU Headform'!X17=\"Green\",'VRU Headform'!X17=\"D Green\"),\"Green\",'VRU Headform'!X17)))","v":0},{"$f":"IF(NOT('VRU Headform'!Y17=\"Blue\"),IF(OR('VRU Headform'!Y17=\"Red\",'VRU Headform'!Y17=\"D Red\"),\"Red\",IF(OR('VRU Headform'!Y17=\"Green\",'VRU Headform'!Y17=\"D Green\"),\"Green\",'VRU Headform'!Y17)))","v":0},"No"]
[null,null,5,{"$f":"IF(NOT('VRU Headform'!E18=\"Blue\"),IF(OR('VRU Headform'!E18=\"Red\",'VRU Headform'!E18=\"D Red\"),\"Red\",IF(OR('VRU Headform'!E18=\"Green\",'VRU Headform'!E18=\"D Green\"),\"Green\",'VRU Headform'!E18)))","v":0},{"$f":"IF(NOT('VRU Headform'!F18=\"Blue\"),IF(OR('VRU Headform'!F18=\"Red\",'VRU Headform'!F18=\"D Red\"),\"Red\",IF(OR('VRU Headform'!F18=\"Green\",'VRU Headform'!F18=\"D Green\"),\"Green\",'VRU Headform'!F18)))","v":0},{"$f":"IF(NOT('VRU Headform'!G18=\"Blue\"),IF(OR('VRU Headform'!G18=\"Red\",'VRU Headform'!G18=\"D Red\"),\"Red\",IF(OR('VRU Headform'!G18=\"Green\",'VRU Headform'!G18=\"D Green\"),\"Green\",'VRU Headform'!G18)))","v":0},{"$f":"IF(NOT('VRU Headform'!H18=\"Blue\"),IF(OR('VRU Headform'!H18=\"Red\",'VRU Headform'!H18=\"D Red\"),\"Red\",IF(OR('VRU Headform'!H18=\"Green\",'VRU Headform'!H18=\"D Green\"),\"Green\",'VRU Headform'!H18)))","v":0},{"$f":"IF(NOT('VRU Headform'!I18=\"Blue\"),IF(OR('VRU Headform'!I18=\"Red\",'VRU Headform'!I18=\"D Red\"),\"Red\",IF(OR('VRU Headform'!I18=\"Green\",'VRU Headform'!I18=\"D Green\"),\"Green\",'VRU Headform'!I18)))","v":0},{"$f":"IF(NOT('VRU Headform'!J18=\"Blue\"),IF(OR('VRU Headform'!J18=\"Red\",'VRU Headform'!J18=\"D Red\"),\"Red\",IF(OR('VRU Headform'!J18=\"Green\",'VRU Headform'!J18=\"D Green\"),\"Green\",'VRU Headform'!J18)))","v":0},{"$f":"IF(NOT('VRU Headform'!K18=\"Blue\"),IF(OR('VRU Headform'!K18=\"Red\",'VRU Headform'!K18=\"D Red\"),\"Red\",IF(OR('VRU Headform'!K18=\"Green\",'VRU Headform'!K18=\"D Green\"),\"Green\",'VRU Headform'!K18)))","v":0},{"$f":"IF(NOT('VRU Headform'!L18=\"Blue\"),IF(OR('VRU Headform'!L18=\"Red\",'VRU Headform'!L18=\"D Red\"),\"Red\",IF(OR('VRU Headform'!L18=\"Green\",'VRU Headform'!L18=\"D Green\"),\"Green\",'VRU Headform'!L18)))","v":0},{"$f":"IF(NOT('VRU Headform'!M18=\"Blue\"),IF(OR('VRU Headform'!M18=\"Red\",'VRU Headform'!M18=\"D Red\"),\"Red\",IF(OR('VRU Headform'!M18=\"Green\",'VRU Headform'!M18=\"D Green\"),\"Green\",'VRU Headform'!M18)))","v":0},{"$f":"IF(NOT('VRU Headform'!N18=\"Blue\"),IF(OR('VRU Headform'!N18=\"Red\",'VRU Headform'!N18=\"D Red\"),\"Red\",IF(OR('VRU Headform'!N18=\"Green\",'VRU Headform'!N18=\"D Green\"),\"Green\",'VRU Headform'!N18)))","v":0},{"$f":"IF(NOT('VRU Headform'!O18=\"Blue\"),IF(OR('VRU Headform'!O18=\"Red\",'VRU Headform'!O18=\"D Red\"),\"Red\",IF(OR('VRU Headform'!O18=\"Green\",'VRU Headform'!O18=\"D Green\"),\"Green\",'VRU Headform'!O18)))","v":0},{"$f":"IF(NOT('VRU Headform'!P18=\"Blue\"),IF(OR('VRU Headform'!P18=\"Red\",'VRU Headform'!P18=\"D Red\"),\"Red\",IF(OR('VRU Headform'!P18=\"Green\",'VRU Headform'!P18=\"D Green\"),\"Green\",'VRU Headform'!P18)))","v":0},{"$f":"IF(NOT('VRU Headform'!Q18=\"Blue\"),IF(OR('VRU Headform'!Q18=\"Red\",'VRU Headform'!Q18=\"D Red\"),\"Red\",IF(OR('VRU Headform'!Q18=\"Green\",'VRU Headform'!Q18=\"D Green\"),\"Green\",'VRU Headform'!Q18)))","v":0},{"$f":"IF(NOT('VRU Headform'!R18=\"Blue\"),IF(OR('VRU Headform'!R18=\"Red\",'VRU Headform'!R18=\"D Red\"),\"Red\",IF(OR('VRU Headform'!R18=\"Green\",'VRU Headform'!R18=\"D Green\"),\"Green\",'VRU Headform'!R18)))","v":0},{"$f":"IF(NOT('VRU Headform'!S18=\"Blue\"),IF(OR('VRU Headform'!S18=\"Red\",'VRU Headform'!S18=\"D Red\"),\"Red\",IF(OR('VRU Headform'!S18=\"Green\",'VRU Headform'!S18=\"D Green\"),\"Green\",'VRU Headform'!S18)))","v":0},{"$f":"IF(NOT('VRU Headform'!T18=\"Blue\"),IF(OR('VRU Headform'!T18=\"Red\",'VRU Headform'!T18=\"D Red\"),\"Red\",IF(OR('VRU Headform'!T18=\"Green\",'VRU Headform'!T18=\"D Green\"),\"Green\",'VRU Headform'!T18)))","v":0},{"$f":"IF(NOT('VRU Headform'!U18=\"Blue\"),IF(OR('VRU Headform'!U18=\"Red\",'VRU Headform'!U18=\"D Red\"),\"Red\",IF(OR('VRU Headform'!U18=\"Green\",'VRU Headform'!U18=\"D Green\"),\"Green\",'VRU Headform'!U18)))","v":0},{"$f":"IF(NOT('VRU Headform'!V18=\"Blue\"),IF(OR('VRU Headform'!V18=\"Red\",'VRU Headform'!V18=\"D Red\"),\"Red\",IF(OR('VRU Headform'!V18=\"Green\",'VRU Headform'!V18=\"D Green\"),\"Green\",'VRU Headform'!V18)))","v":0},{"$f":"IF(NOT('VRU Headform'!W18=\"Blue\"),IF(OR('VRU Headform'!W18=\"Red\",'VRU Headform'!W18=\"D Red\"),\"Red\",IF(OR('VRU Headform'!W18=\"Green\",'VRU Headform'!W18=\"D Green\"),\"Green\",'VRU Headform'!W18)))","v":0},{"$f":"IF(NOT('VRU Headform'!X18=\"Blue\"),IF(OR('VRU Headform'!X18=\"Red\",'VRU Headform'!X18=\"D Red\"),\"Red\",IF(OR('VRU Headform'!X18=\"Green\",'VRU Headform'!X18=\"D Green\"),\"Green\",'VRU Headform'!X18)))","v":0},{"$f":"IF(NOT('VRU Headform'!Y18=\"Blue\"),IF(OR('VRU Headform'!Y18=\"Red\",'VRU Headform'!Y18=\"D Red\"),\"Red\",IF(OR('VRU Headform'!Y18=\"Green\",'VRU Headform'!Y18=\"D Green\"),\"Green\",'VRU Headform'!Y18)))","v":0},"No"]
[null,null,4,{"$f":"IF(NOT('VRU Headform'!E19=\"Blue\"),IF(OR('VRU Headform'!E19=\"Red\",'VRU Headform'!E19=\"D Red\"),\"Red\",IF(OR('VRU Headform'!E19=\"Green\",'VRU Headform'!E19=\"D Green\"),\"Green\",'VRU Headform'!E19)))","v":0},{"$f":"IF(NOT('VRU Headform'!F19=\"Blue\"),IF(OR('VRU Headform'!F19=\"Red\",'VRU Headform'!F19=\"D Red\"),\"Red\",IF(OR('VRU Headform'!F19=\"Green\",'VRU Headform'!F19=\"D Green\"),\"Green\",'VRU Headform'!F19)))","v":0},{"$f":"IF(NOT('VRU Headform'!G19=\"Blue\"),IF(OR('VRU Headform'!G19=\"Red\",'VRU Headform'!G19=\"D Red\"),\"Red\",IF(OR('VRU Headform'!G19=\"Green\",'VRU Headform'!G19=\"D Green\"),\"Green\",'VRU Headform'!G19)))","v":0},{"$f":"IF(NOT('VRU Headform'!H19=\"Blue\"),IF(OR('VRU Headform'!H19=\"Red\",'VRU Headform'!H19=\"D Red\"),\"Red\",IF(OR('VRU Headform'!H19=\"Green\",'VRU Headform'!H19=\"D Green\"),\"Green\",'VRU Headform'!H19)))","v":0},{"$f":"IF(NOT('VRU Headform'!I19=\"Blue\"),IF(OR('VRU Headform'!I19=\"Red\",'VRU Headform'!I19=\"D Red\"),\"Red\",IF(OR('VRU Headform'!I19=\"Green\",'VRU Headform'!I19=\"D Green\"),\"Green\",'VRU Headform'!I19)))","v":0},{"$f":"IF(NOT('VRU Headform'!J19=\"Blue\"),IF(OR('VRU Headform'!J19=\"Red\",'VRU Headform'!J19=\"D Red\"),\"Red\",IF(OR('VRU Headform'!J19=\"Green\",'VRU Headform'!J19=\"D Green\"),\"Green\",'VRU Headform'!J19)))","v":0},{"$f":"IF(NOT('VRU Headform'!K19=\"Blue\"),IF(OR('VRU Headform'!K19=\"Red\",'VRU Headform'!K19=\"D Red\"),\"Red\",IF(OR('VRU Headform'!K19=\"Green\",'VRU Headform'!K19=\"D Green\"),\"Green\",'VRU Headform'!K19)))","v":0},{"$f":"IF(NOT('VRU Headform'!L19=\"Blue\"),IF(OR('VRU Headform'!L19=\"Red\",'VRU Headform'!L19=\"D Red\"),\"Red\",IF(OR('VRU Headform'!L19=\"Green\",'VRU Headform'!L19=\"D Green\"),\"Green\",'VRU Headform'!L19)))","v":0},{"$f":"IF(NOT('VRU Headform'!M19=\"Blue\"),IF(OR('VRU Headform'!M19=\"Red\",'VRU Headform'!M19=\"D Red\"),\"Red\",IF(OR('VRU Headform'!M19=\"Green\",'VRU Headform'!M19=\"D Green\"),\"Green\",'VRU Headform'!M19)))","v":0},{"$f":"IF(NOT('VRU Headform'!N19=\"Blue\"),IF(OR('VRU Headform'!N19=\"Red\",'VRU Headform'!N19=\"D Red\"),\"Red\",IF(OR('VRU Headform'!N19=\"Green\",'VRU Headform'!N19=\"D Green\"),\"Green\",'VRU Headform'!N19)))","v":0},{"$f":"IF(NOT('VRU Headform'!O19=\"Blue\"),IF(OR('VRU Headform'!O19=\"Red\",'VRU Headform'!O19=\"D Red\"),\"Red\",IF(OR('VRU Headform'!O19=\"Green\",'VRU Headform'!O19=\"D Green\"),\"Green\",'VRU Headform'!O19)))","v":0},{"$f":"IF(NOT('VRU Headform'!P19=\"Blue\"),IF(OR('VRU Headform'!P19=\"Red\",'VRU Headform'!P19=\"D Red\"),\"Red\",IF(OR('VRU Headform'!P19=\"Green\",'VRU Headform'!P19=\"D Green\"),\"Green\",'VRU Headform'!P19)))","v":0},{"$f":"IF(NOT('VRU Headform'!Q19=\"Blue\"),IF(OR('VRU Headform'!Q19=\"Red\",'VRU Headform'!Q19=\"D Red\"),\"Red\",IF(OR('VRU Headform'!Q19=\"Green\",'VRU Headform'!Q19=\"D Green\"),\"Green\",'VRU Headform'!Q19)))","v":0},{"$f":"IF(NOT('VRU Headform'!R19=\"Blue\"),IF(OR('VRU Headform'!R19=\"Red\",'VRU Headform'!R19=\"D Red\"),\"Red\",IF(OR('VRU Headform'!R19=\"Green\",'VRU Headform'!R19=\"D Green\"),\"Green\",'VRU Headform'!R19)))","v":0},{"$f":"IF(NOT('VRU Headform'!S19=\"Blue\"),IF(OR('VRU Headform'!S19=\"Red\",'VRU Headform'!S19=\"D Red\"),\"Red\",IF(OR('VRU Headform'!S19=\"Green\",'VRU Headform'!S19=\"D Green\"),\"Green\",'VRU Headform'!S19)))","v":0},{"$f":"IF(NOT('VRU Headform'!T19=\"Blue\"),IF(OR('VRU Headform'!T19=\"Red\",'VRU Headform'!T19=\"D Red\"),\"Red\",IF(OR('VRU Headform'!T19=\"Green\",'VRU Headform'!T19=\"D Green\"),\"Green\",'VRU Headform'!T19)))","v":0},{"$f":"IF(NOT('VRU Headform'!U19=\"Blue\"),IF(OR('VRU Headform'!U19=\"Red\",'VRU Headform'!U19=\"D Red\"),\"Red\",IF(OR('VRU Headform'!U19=\"Green\",'VRU Headform'!U19=\"D Green\"),\"Green\",'VRU Headform'!U19)))","v":0},{"$f":"IF(NOT('VRU Headform'!V19=\"Blue\"),IF(OR('VRU Headform'!V19=\"Red\",'VRU Headform'!V19=\"D Red\"),\"Red\",IF(OR('VRU Headform'!V19=\"Green\",'VRU Headform'!V19=\"D Green\"),\"Green\",'VRU Headform'!V19)))","v":0},{"$f":"IF(NOT('VRU Headform'!W19=\"Blue\"),IF(OR('VRU Headform'!W19=\"Red\",'VRU Headform'!W19=\"D Red\"),\"Red\",IF(OR('VRU Headform'!W19=\"Green\",'VRU Headform'!W19=\"D Green\"),\"Green\",'VRU Headform'!W19)))","v":0},{"$f":"IF(NOT('VRU Headform'!X19=\"Blue\"),IF(OR('VRU Headform'!X19=\"Red\",'VRU Headform'!X19=\"D Red\"),\"Red\",IF(OR('VRU Headform'!X19=\"Green\",'VRU Headform'!X19=\"D Green\"),\"Green\",'VRU Headform'!X19)))","v":0},{"$f":"IF(NOT('VRU Headform'!Y19=\"Blue\"),IF(OR('VRU Headform'!Y19=\"Red\",'VRU Headform'!Y19=\"D Red\"),\"Red\",IF(OR('VRU Headform'!Y19=\"Green\",'VRU Headform'!Y19=\"D Green\"),\"Green\",'VRU Headform'!Y19)))","v":0},"No"]
[null,null,3,{"$f":"IF(NOT('VRU Headform'!E20=\"Blue\"),IF(OR('VRU Headform'!E20=\"Red\",'VRU Headform'!E20=\"D Red\"),\"Red\",IF(OR('VRU Headform'!E20=\"Green\",'VRU Headform'!E20=\"D Green\"),\"Green\",'VRU Headform'!E20)))","v":0},{"$f":"IF(NOT('VRU Headform'!F20=\"Blue\"),IF(OR('VRU Headform'!F20=\"Red\",'VRU Headform'!F20=\"D Red\"),\"Red\",IF(OR('VRU Headform'!F20=\"Green\",'VRU Headform'!F20=\"D Green\"),\"Green\",'VRU Headform'!F20)))","v":0},{"$f":"IF(NOT('VRU Headform'!G20=\"Blue\"),IF(OR('VRU Headform'!G20=\"Red\",'VRU Headform'!G20=\"D Red\"),\"Red\",IF(OR('VRU Headform'!G20=\"Green\",'VRU Headform'!G20=\"D Green\"),\"Green\",'VRU Headform'!G20)))","v":0},{"$f":"IF(NOT('VRU Headform'!H20=\"Blue\"),IF(OR('VRU Headform'!H20=\"Red\",'VRU Headform'!H20=\"D Red\"),\"Red\",IF(OR('VRU Headform'!H20=\"Green\",'VRU Headform'!H20=\"D Green\"),\"Green\",'VRU Headform'!H20)))","v":0},{"$f":"IF(NOT('VRU Headform'!I20=\"Blue\"),IF(OR('VRU Headform'!I20=\"Red\",'VRU Headform'!I20=\"D Red\"),\"Red\",IF(OR('VRU Headform'!I20=\"Green\",'VRU Headform'!I20=\"D Green\"),\"Green\",'VRU Headform'!I20)))","v":0},{"$f":"IF(NOT('VRU Headform'!J20=\"Blue\"),IF(OR('VRU Headform'!J20=\"Red\",'VRU Headform'!J20=\"D Red\"),\"Red\",IF(OR('VRU Headform'!J20=\"Green\",'VRU Headform'!J20=\"D Green\"),\"Green\",'VRU Headform'!J20)))","v":0},{"$f":"IF(NOT('VRU Headform'!K20=\"Blue\"),IF(OR('VRU Headform'!K20=\"Red\",'VRU Headform'!K20=\"D Red\"),\"Red\",IF(OR('VRU Headform'!K20=\"Green\",'VRU Headform'!K20=\"D Green\"),\"Green\",'VRU Headform'!K20)))","v":0},{"$f":"IF(NOT('VRU Headform'!L20=\"Blue\"),IF(OR('VRU Headform'!L20=\"Red\",'VRU Headform'!L20=\"D Red\"),\"Red\",IF(OR('VRU Headform'!L20=\"Green\",'VRU Headform'!L20=\"D Green\"),\"Green\",'VRU Headform'!L20)))","v":0},{"$f":"IF(NOT('VRU Headform'!M20=\"Blue\"),IF(OR('VRU Headform'!M20=\"Red\",'VRU Headform'!M20=\"D Red\"),\"Red\",IF(OR('VRU Headform'!M20=\"Green\",'VRU Headform'!M20=\"D Green\"),\"Green\",'VRU Headform'!M20)))","v":0},{"$f":"IF(NOT('VRU Headform'!N20=\"Blue\"),IF(OR('VRU Headform'!N20=\"Red\",'VRU Headform'!N20=\"D Red\"),\"Red\",IF(OR('VRU Headform'!N20=\"Green\",'VRU Headform'!N20=\"D Green\"),\"Green\",'VRU Headform'!N20)))","v":0},{"$f":"IF(NOT('VRU Headform'!O20=\"Blue\"),IF(OR('VRU Headform'!O20=\"Red\",'VRU Headform'!O20=\"D Red\"),\"Red\",IF(OR('VRU Headform'!O20=\"Green\",'VRU Headform'!O20=\"D Green\"),\"Green\",'VRU Headform'!O20)))","v":0},{"$f":"IF(NOT('VRU Headform'!P20=\"Blue\"),IF(OR('VRU Headform'!P20=\"Red\",'VRU Headform'!P20=\"D Red\"),\"Red\",IF(OR('VRU Headform'!P20=\"Green\",'VRU Headform'!P20=\"D Green\"),\"Green\",'VRU Headform'!P20)))","v":0},{"$f":"IF(NOT('VRU Headform'!Q20=\"Blue\"),IF(OR('VRU Headform'!Q20=\"Red\",'VRU Headform'!Q20=\"D Red\"),\"Red\",IF(OR('VRU Headform'!Q20=\"Green\",'VRU Headform'!Q20=\"D Green\"),\"Green\",'VRU Headform'!Q20)))","v":0},{"$f":"IF(NOT('VRU Headform'!R20=\"Blue\"),IF(OR('VRU Headform'!R20=\"Red\",'VRU Headform'!R20=\"D Red\"),\"Red\",IF(OR('VRU Headform'!R20=\"Green\",'VRU Headform'!R20=\"D Green\"),\"Green\",'VRU Headform'!R20)))","v":0},{"$f":"IF(NOT('VRU Headform'!S20=\"Blue\"),IF(OR('VRU Headform'!S20=\"Red\",'VRU Headform'!S20=\"D Red\"),\"Red\",IF(OR('VRU Headform'!S20=\"Green\",'VRU Headform'!S20=\"D Green\"),\"Green\",'VRU Headform'!S20)))","v":0},{"$f":"IF(NOT('VRU Headform'!T20=\"Blue\"),IF(OR('VRU Headform'!T20=\"Red\",'VRU Headform'!T20=\"D Red\"),\"Red\",IF(OR('VRU Headform'!T20=\"Green\",'VRU Headform'!T20=\"D Green\"),\"Green\",'VRU Headform'!T20)))","v":0},{"$f":"IF(NOT('VRU Headform'!U20=\"Blue\"),IF(OR('VRU Headform'!U20=\"Red\",'VRU Headform'!U20=\"D Red\"),\"Red\",IF(OR('VRU Headform'!U20=\"Green\",'VRU Headform'!U20=\"D Green\"),\"Green\",'VRU Headform'!U20)))","v":0},{"$f":"IF(NOT('VRU Headform'!V20=\"Blue\"),IF(OR('VRU Headform'!V20=\"Red\",'VRU Headform'!V20=\"D Red\"),\"Red\",IF(OR('VRU Headform'!V20=\"Green\",'VRU Headform'!V20=\"D Green\"),\"Green\",'VRU Headform'!V20)))","v":0},{"$f":"IF(NOT('VRU Headform'!W20=\"Blue\"),IF(OR('VRU Headform'!W20=\"Red\",'VRU Headform'!W20=\"D Red\"),\"Red\",IF(OR('VRU Headform'!W20=\"Green\",'VRU Headform'!W20=\"D Green\"),\"Green\",'VRU Headform'!W20)))","v":0},{"$f":"IF(NOT('VRU Headform'!X20=\"Blue\"),IF(OR('VRU Headform'!X20=\"Red\",'VRU Headform'!X20=\"D Red\"),\"Red\",IF(OR('VRU Headform'!X20=\"Green\",'VRU Headform'!X20=\"D Green\"),\"Green\",'VRU Headform'!X20)))","v":0},{"$f":"IF(NOT('VRU Headform'!Y20=\"Blue\"),IF(OR('VRU Headform'!Y20=\"Red\",'VRU Headform'!Y20=\"D Red\"),\"Red\",IF(OR('VRU Headform'!Y20=\"Green\",'VRU Headform'!Y20=\"D Green\"),\"Green\",'VRU Headform'!Y20)))","v":0},"No"]
[null,null,2,{"$f":"IF(NOT('VRU Headform'!E21=\"Blue\"),IF(OR('VRU Headform'!E21=\"Red\",'VRU Headform'!E21=\"D Red\"),\"Red\",IF(OR('VRU Headform'!E21=\"Green\",'VRU Headform'!E21=\"D Green\"),\"Green\",'VRU Headform'!E21)))","v":0},{"$f":"IF(NOT('VRU Headform'!F21=\"Blue\"),IF(OR('VRU Headform'!F21=\"Red\",'VRU Headform'!F21=\"D Red\"),\"Red\",IF(OR('VRU Headform'!F21=\"Green\",'VRU Headform'!F21=\"D Green\"),\"Green\",'VRU Headform'!F21)))","v":0},{"$f":"IF(NOT('VRU Headform'!G21=\"Blue\"),IF(OR('VRU Headform'!G21=\"Red\",'VRU Headform'!G21=\"D Red\"),\"Red\",IF(OR('VRU Headform'!G21=\"Green\",'VRU Headform'!G21=\"D Green\"),\"Green\",'VRU Headform'!G21)))","v":0},{"$f":"IF(NOT('VRU Headform'!H21=\"Blue\"),IF(OR('VRU Headform'!H21=\"Red\",'VRU Headform'!H21=\"D Red\"),\"Red\",IF(OR('VRU Headform'!H21=\"Green\",'VRU Headform'!H21=\"D Green\"),\"Green\",'VRU Headform'!H21)))","v":0},{"$f":"IF(NOT('VRU Headform'!I21=\"Blue\"),IF(OR('VRU Headform'!I21=\"Red\",'VRU Headform'!I21=\"D Red\"),\"Red\",IF(OR('VRU Headform'!I21=\"Green\",'VRU Headform'!I21=\"D Green\"),\"Green\",'VRU Headform'!I21)))","v":0},{"$f":"IF(NOT('VRU Headform'!J21=\"Blue\"),IF(OR('VRU Headform'!J21=\"Red\",'VRU Headform'!J21=\"D Red\"),\"Red\",IF(OR('VRU Headform'!J21=\"Green\",'VRU Headform'!J21=\"D Green\"),\"Green\",'VRU Headform'!J21)))","v":0},{"$f":"IF(NOT('VRU Headform'!K21=\"Blue\"),IF(OR('VRU Headform'!K21=\"Red\",'VRU Headform'!K21=\"D Red\"),\"Red\",IF(OR('VRU Headform'!K21=\"Green\",'VRU Headform'!K21=\"D Green\"),\"Green\",'VRU Headform'!K21)))","v":0},{"$f":"IF(NOT('VRU Headform'!L21=\"Blue\"),IF(OR('VRU Headform'!L21=\"Red\",'VRU Headform'!L21=\"D Red\"),\"Red\",IF(OR('VRU Headform'!L21=\"Green\",'VRU Headform'!L21=\"D Green\"),\"Green\",'VRU Headform'!L21)))","v":0},{"$f":"IF(NOT('VRU Headform'!M21=\"Blue\"),IF(OR('VRU Headform'!M21=\"Red\",'VRU Headform'!M21=\"D Red\"),\"Red\",IF(OR('VRU Headform'!M21=\"Green\",'VRU Headform'!M21=\"D Green\"),\"Green\",'VRU Headform'!M21)))","v":0},{"$f":"IF(NOT('VRU Headform'!N21=\"Blue\"),IF(OR('VRU Headform'!N21=\"Red\",'VRU Headform'!N21=\"D Red\"),\"Red\",IF(OR('VRU Headform'!N21=\"Green\",'VRU Headform'!N21=\"D Green\"),\"Green\",'VRU Headform'!N21)))","v":0},{"$f":"IF(NOT('VRU Headform'!O21=\"Blue\"),IF(OR('VRU Headform'!O21=\"Red\",'VRU Headform'!O21=\"D Red\"),\"Red\",IF(OR('VRU Headform'!O21=\"Green\",'VRU Headform'!O21=\"D Green\"),\"Green\",'VRU Headform'!O21)))","v":0},{"$f":"IF(NOT('VRU Headform'!P21=\"Blue\"),IF(OR('VRU Headform'!P21=\"Red\",'VRU Headform'!P21=\"D Red\"),\"Red\",IF(OR('VRU Headform'!P21=\"Green\",'VRU Headform'!P21=\"D Green\"),\"Green\",'VRU Headform'!P21)))","v":0},{"$f":"IF(NOT('VRU Headform'!Q21=\"Blue\"),IF(OR('VRU Headform'!Q21=\"Red\",'VRU Headform'!Q21=\"D Red\"),\"Red\",IF(OR('VRU Headform'!Q21=\"Green\",'VRU Headform'!Q21=\"D Green\"),\"Green\",'VRU Headform'!Q21)))","v":0},{"$f":"IF(NOT('VRU Headform'!R21=\"Blue\"),IF(OR('VRU Headform'!R21=\"Red\",'VRU Headform'!R21=\"D Red\"),\"Red\",IF(OR('VRU Headform'!R21=\"Green\",'VRU Headform'!R21=\"D Green\"),\"Green\",'VRU Headform'!R21)))","v":0},{"$f":"IF(NOT('VRU Headform'!S21=\"Blue\"),IF(OR('VRU Headform'!S21=\"Red\",'VRU Headform'!S21=\"D Red\"),\"Red\",IF(OR('VRU Headform'!S21=\"Green\",'VRU Headform'!S21=\"D Green\"),\"Green\",'VRU Headform'!S21)))","v":0},{"$f":"IF(NOT('VRU Headform'!T21=\"Blue\"),IF(OR('VRU Headform'!T21=\"Red\",'VRU Headform'!T21=\"D Red\"),\"Red\",IF(OR('VRU Headform'!T21=\"Green\",'VRU Headform'!T21=\"D Green\"),\"Green\",'VRU Headform'!T21)))","v":0},{"$f":"IF(NOT('VRU Headform'!U21=\"Blue\"),IF(OR('VRU Headform'!U21=\"Red\",'VRU Headform'!U21=\"D Red\"),\"Red\",IF(OR('VRU Headform'!U21=\"Green\",'VRU Headform'!U21=\"D Green\"),\"Green\",'VRU Headform'!U21)))","v":0},{"$f":"IF(NOT('VRU Headform'!V21=\"Blue\"),IF(OR('VRU Headform'!V21=\"Red\",'VRU Headform'!V21=\"D Red\"),\"Red\",IF(OR('VRU Headform'!V21=\"Green\",'VRU Headform'!V21=\"D Green\"),\"Green\",'VRU Headform'!V21)))","v":0},{"$f":"IF(NOT('VRU Headform'!W21=\"Blue\"),IF(OR('VRU Headform'!W21=\"Red\",'VRU Headform'!W21=\"D Red\"),\"Red\",IF(OR('VRU Headform'!W21=\"Green\",'VRU Headform'!W21=\"D Green\"),\"Green\",'VRU Headform'!W21)))","v":0},{"$f":"IF(NOT('VRU Headform'!X21=\"Blue\"),IF(OR('VRU Headform'!X21=\"Red\",'VRU Headform'!X21=\"D Red\"),\"Red\",IF(OR('VRU Headform'!X21=\"Green\",'VRU Headform'!X21=\"D Green\"),\"Green\",'VRU Headform'!X21)))","v":0},{"$f":"IF(NOT('VRU Headform'!Y21=\"Blue\"),IF(OR('VRU Headform'!Y21=\"Red\",'VRU Headform'!Y21=\"D Red\"),\"Red\",IF(OR('VRU Headform'!Y21=\"Green\",'VRU Headform'!Y21=\"D Green\"),\"Green\",'VRU Headform'!Y21)))","v":0},"No"]
[null,null,1,{"$f":"IF(NOT('VRU Headform'!E22=\"Blue\"),IF(OR('VRU Headform'!E22=\"Red\",'VRU Headform'!E22=\"D Red\"),\"Red\",IF(OR('VRU Headform'!E22=\"Green\",'VRU Headform'!E22=\"D Green\"),\"Green\",'VRU Headform'!E22)))","v":0},{"$f":"IF(NOT('VRU Headform'!F22=\"Blue\"),IF(OR('VRU Headform'!F22=\"Red\",'VRU Headform'!F22=\"D Red\"),\"Red\",IF(OR('VRU Headform'!F22=\"Green\",'VRU Headform'!F22=\"D Green\"),\"Green\",'VRU Headform'!F22)))","v":0},{"$f":"IF(NOT('VRU Headform'!G22=\"Blue\"),IF(OR('VRU Headform'!G22=\"Red\",'VRU Headform'!G22=\"D Red\"),\"Red\",IF(OR('VRU Headform'!G22=\"Green\",'VRU Headform'!G22=\"D Green\"),\"Green\",'VRU Headform'!G22)))","v":0},{"$f":"IF(NOT('VRU Headform'!H22=\"Blue\"),IF(OR('VRU Headform'!H22=\"Red\",'VRU Headform'!H22=\"D Red\"),\"Red\",IF(OR('VRU Headform'!H22=\"Green\",'VRU Headform'!H22=\"D Green\"),\"Green\",'VRU Headform'!H22)))","v":0},{"$f":"IF(NOT('VRU Headform'!I22=\"Blue\"),IF(OR('VRU Headform'!I22=\"Red\",'VRU Headform'!I22=\"D Red\"),\"Red\",IF(OR('VRU Headform'!I22=\"Green\",'VRU Headform'!I22=\"D Green\"),\"Green\",'VRU Headform'!I22)))","v":0},{"$f":"IF(NOT('VRU Headform'!J22=\"Blue\"),IF(OR('VRU Headform'!J22=\"Red\",'VRU Headform'!J22=\"D Red\"),\"Red\",IF(OR('VRU Headform'!J22=\"Green\",'VRU Headform'!J22=\"D Green\"),\"Green\",'VRU Headform'!J22)))","v":0},{"$f":"IF(NOT('VRU Headform'!K22=\"Blue\"),IF(OR('VRU Headform'!K22=\"Red\",'VRU Headform'!K22=\"D Red\"),\"Red\",IF(OR('VRU Headform'!K22=\"Green\",'VRU Headform'!K22=\"D Green\"),\"Green\",'VRU Headform'!K22)))","v":0},{"$f":"IF(NOT('VRU Headform'!L22=\"Blue\"),IF(OR('VRU Headform'!L22=\"Red\",'VRU Headform'!L22=\"D Red\"),\"Red\",IF(OR('VRU Headform'!L22=\"Green\",'VRU Headform'!L22=\"D Green\"),\"Green\",'VRU Headform'!L22)))","v":0},{"$f":"IF(NOT('VRU Headform'!M22=\"Blue\"),IF(OR('VRU Headform'!M22=\"Red\",'VRU Headform'!M22=\"D Red\"),\"Red\",IF(OR('VRU Headform'!M22=\"Green\",'VRU Headform'!M22=\"D Green\"),\"Green\",'VRU Headform'!M22)))","v":0},{"$f":"IF(NOT('VRU Headform'!N22=\"Blue\"),IF(OR('VRU Headform'!N22=\"Red\",'VRU Headform'!N22=\"D Red\"),\"Red\",IF(OR('VRU Headform'!N22=\"Green\",'VRU Headform'!N22=\"D Green\"),\"Green\",'VRU Headform'!N22)))","v":0},{"$f":"IF(NOT('VRU Headform'!O22=\"Blue\"),IF(OR('VRU Headform'!O22=\"Red\",'VRU Headform'!O22=\"D Red\"),\"Red\",IF(OR('VRU Headform'!O22=\"Green\",'VRU Headform'!O22=\"D Green\"),\"Green\",'VRU Headform'!O22)))","v":0},{"$f":"IF(NOT('VRU Headform'!P22=\"Blue\"),IF(OR('VRU Headform'!P22=\"Red\",'VRU Headform'!P22=\"D Red\"),\"Red\",IF(OR('VRU Headform'!P22=\"Green\",'VRU Headform'!P22=\"D Green\"),\"Green\",'VRU Headform'!P22)))","v":0},{"$f":"IF(NOT('VRU Headform'!Q22=\"Blue\"),IF(OR('VRU Headform'!Q22=\"Red\",'VRU Headform'!Q22=\"D Red\"),\"Red\",IF(OR('VRU Headform'!Q22=\"Green\",'VRU Headform'!Q22=\"D Green\"),\"Green\",'VRU Headform'!Q22)))","v":0},{"$f":"IF(NOT('VRU Headform'!R22=\"Blue\"),IF(OR('VRU Headform'!R22=\"Red\",'VRU Headform'!R22=\"D Red\"),\"Red\",IF(OR('VRU Headform'!R22=\"Green\",'VRU Headform'!R22=\"D Green\"),\"Green\",'VRU Headform'!R22)))","v":0},{"$f":"IF(NOT('VRU Headform'!S22=\"Blue\"),IF(OR('VRU Headform'!S22=\"Red\",'VRU Headform'!S22=\"D Red\"),\"Red\",IF(OR('VRU Headform'!S22=\"Green\",'VRU Headform'!S22=\"D Green\"),\"Green\",'VRU Headform'!S22)))","v":0},{"$f":"IF(NOT('VRU Headform'!T22=\"Blue\"),IF(OR('VRU Headform'!T22=\"Red\",'VRU Headform'!T22=\"D Red\"),\"Red\",IF(OR('VRU Headform'!T22=\"Green\",'VRU Headform'!T22=\"D Green\"),\"Green\",'VRU Headform'!T22)))","v":0},{"$f":"IF(NOT('VRU Headform'!U22=\"Blue\"),IF(OR('VRU Headform'!U22=\"Red\",'VRU Headform'!U22=\"D Red\"),\"Red\",IF(OR('VRU Headform'!U22=\"Green\",'VRU Headform'!U22=\"D Green\"),\"Green\",'VRU Headform'!U22)))","v":0},{"$f":"IF(NOT('VRU Headform'!V22=\"Blue\"),IF(OR('VRU Headform'!V22=\"Red\",'VRU Headform'!V22=\"D Red\"),\"Red\",IF(OR('VRU Headform'!V22=\"Green\",'VRU Headform'!V22=\"D Green\"),\"Green\",'VRU Headform'!V22)))","v":0},{"$f":"IF(NOT('VRU Headform'!W22=\"Blue\"),IF(OR('VRU Headform'!W22=\"Red\",'VRU Headform'!W22=\"D Red\"),\"Red\",IF(OR('VRU Headform'!W22=\"Green\",'VRU Headform'!W22=\"D Green\"),\"Green\",'VRU Headform'!W22)))","v":0},{"$f":"IF(NOT('VRU Headform'!X22=\"Blue\"),IF(OR('VRU Headform'!X22=\"Red\",'VRU Headform'!X22=\"D Red\"),\"Red\",IF(OR('VRU Headform'!X22=\"Green\",'VRU Headform'!X22=\"D Green\"),\"Green\",'VRU Headform'!X22)))","v":0},{"$f":"IF(NOT('VRU Headform'!Y22=\"Blue\"),IF(OR('VRU Headform'!Y22=\"Red\",'VRU Headform'!Y22=\"D Red\"),\"Red\",IF(OR('VRU Headform'!Y22=\"Green\",'VRU Headform'!Y22=\"D Green\"),\"Green\",'VRU Headform'!Y22)))","v":0},"No"]
[null,null,0,{"$f":"IF(NOT('VRU Headform'!E23=\"Blue\"),IF(OR('VRU Headform'!E23=\"Red\",'VRU Headform'!E23=\"D Red\"),\"Red\",IF(OR('VRU Headform'!E23=\"Green\",'VRU Headform'!E23=\"D Green\"),\"Green\",'VRU Headform'!E23)))","v":0},{"$f":"IF(NOT('VRU Headform'!F23=\"Blue\"),IF(OR('VRU Headform'!F23=\"Red\",'VRU Headform'!F23=\"D Red\"),\"Red\",IF(OR('VRU Headform'!F23=\"Green\",'VRU Headform'!F23=\"D Green\"),\"Green\",'VRU Headform'!F23)))","v":0},{"$f":"IF(NOT('VRU Headform'!G23=\"Blue\"),IF(OR('VRU Headform'!G23=\"Red\",'VRU Headform'!G23=\"D Red\"),\"Red\",IF(OR('VRU Headform'!G23=\"Green\",'VRU Headform'!G23=\"D Green\"),\"Green\",'VRU Headform'!G23)))","v":0},{"$f":"IF(NOT('VRU Headform'!H23=\"Blue\"),IF(OR('VRU Headform'!H23=\"Red\",'VRU Headform'!H23=\"D Red\"),\"Red\",IF(OR('VRU Headform'!H23=\"Green\",'VRU Headform'!H23=\"D Green\"),\"Green\",'VRU Headform'!H23)))","v":0},{"$f":"IF(NOT('VRU Headform'!I23=\"Blue\"),IF(OR('VRU Headform'!I23=\"Red\",'VRU Headform'!I23=\"D Red\"),\"Red\",IF(OR('VRU Headform'!I23=\"Green\",'VRU Headform'!I23=\"D Green\"),\"Green\",'VRU Headform'!I23)))","v":0},{"$f":"IF(NOT('VRU Headform'!J23=\"Blue\"),IF(OR('VRU Headform'!J23=\"Red\",'VRU Headform'!J23=\"D Red\"),\"Red\",IF(OR('VRU Headform'!J23=\"Green\",'VRU Headform'!J23=\"D Green\"),\"Green\",'VRU Headform'!J23)))","v":0},{"$f":"IF(NOT('VRU Headform'!K23=\"Blue\"),IF(OR('VRU Headform'!K23=\"Red\",'VRU Headform'!K23=\"D Red\"),\"Red\",IF(OR('VRU Headform'!K23=\"Green\",'VRU Headform'!K23=\"D Green\"),\"Green\",'VRU Headform'!K23)))","v":0},{"$f":"IF(NOT('VRU Headform'!L23=\"Blue\"),IF(OR('VRU Headform'!L23=\"Red\",'VRU Headform'!L23=\"D Red\"),\"Red\",IF(OR('VRU Headform'!L23=\"Green\",'VRU Headform'!L23=\"D Green\"),\"Green\",'VRU Headform'!L23)))","v":0},{"$f":"IF(NOT('VRU Headform'!M23=\"Blue\"),IF(OR('VRU Headform'!M23=\"Red\",'VRU Headform'!M23=\"D Red\"),\"Red\",IF(OR('VRU Headform'!M23=\"Green\",'VRU Headform'!M23=\"D Green\"),\"Green\",'VRU Headform'!M23)))","v":0},{"$f":"IF(NOT('VRU Headform'!N23=\"Blue\"),IF(OR('VRU Headform'!N23=\"Red\",'VRU Headform'!N23=\"D Red\"),\"Red\",IF(OR('VRU Headform'!N23=\"Green\",'VRU Headform'!N23=\"D Green\"),\"Green\",'VRU Headform'!N23)))","v":0},{"$f":"IF(NOT('VRU Headform'!O23=\"Blue\"),IF(OR('VRU Headform'!O23=\"Red\",'VRU Headform'!O23=\"D Red\"),\"Red\",IF(OR('VRU Headform'!O23=\"Green\",'VRU Headform'!O23=\"D Green\"),\"Green\",'VRU Headform'!O23)))","v":0},{"$f":"IF(NOT('VRU Headform'!P23=\"Blue\"),IF(OR('VRU Headform'!P23=\"Red\",'VRU Headform'!P23=\"D Red\"),\"Red\",IF(OR('VRU Headform'!P23=\"Green\",'VRU Headform'!P23=\"D Green\"),\"Green\",'VRU Headform'!P23)))","v":0},{"$f":"IF(NOT('VRU Headform'!Q23=\"Blue\"),IF(OR('VRU Headform'!Q23=\"Red\",'VRU Headform'!Q23=\"D Red\"),\"Red\",IF(OR('VRU Headform'!Q23=\"Green\",'VRU Headform'!Q23=\"D Green\"),\"Green\",'VRU Headform'!Q23)))","v":0},{"$f":"IF(NOT('VRU Headform'!R23=\"Blue\"),IF(OR('VRU Headform'!R23=\"Red\",'VRU Headform'!R23=\"D Red\"),\"Red\",IF(OR('VRU Headform'!R23=\"Green\",'VRU Headform'!R23=\"D Green\"),\"Green\",'VRU Headform'!R23)))","v":0},{"$f":"IF(NOT('VRU Headform'!S23=\"Blue\"),IF(OR('VRU Headform'!S23=\"Red\",'VRU Headform'!S23=\"D Red\"),\"Red\",IF(OR('VRU Headform'!S23=\"Green\",'VRU Headform'!S23=\"D Green\"),\"Green\",'VRU Headform'!S23)))","v":0},{"$f":"IF(NOT('VRU Headform'!T23=\"Blue\"),IF(OR('VRU Headform'!T23=\"Red\",'VRU Headform'!T23=\"D Red\"),\"Red\",IF(OR('VRU Headform'!T23=\"Green\",'VRU Headform'!T23=\"D Green\"),\"Green\",'VRU Headform'!T23)))","v":0},{"$f":"IF(NOT('VRU Headform'!U23=\"Blue\"),IF(OR('VRU Headform'!U23=\"Red\",'VRU Headform'!U23=\"D Red\"),\"Red\",IF(OR('VRU Headform'!U23=\"Green\",'VRU Headform'!U23=\"D Green\"),\"Green\",'VRU Headform'!U23)))","v":0},{"$f":"IF(NOT('VRU Headform'!V23=\"Blue\"),IF(OR('VRU Headform'!V23=\"Red\",'VRU Headform'!V23=\"D Red\"),\"Red\",IF(OR('VRU Headform'!V23=\"Green\",'VRU Headform'!V23=\"D Green\"),\"Green\",'VRU Headform'!V23)))","v":0},{"$f":"IF(NOT('VRU Headform'!W23=\"Blue\"),IF(OR('VRU Headform'!W23=\"Red\",'VRU Headform'!W23=\"D Red\"),\"Red\",IF(OR('VRU Headform'!W23=\"Green\",'VRU Headform'!W23=\"D Green\"),\"Green\",'VRU Headform'!W23)))","v":0},{"$f":"IF(NOT('VRU Headform'!X23=\"Blue\"),IF(OR('VRU Headform'!X23=\"Red\",'VRU Headform'!X23=\"D Red\"),\"Red\",IF(OR('VRU Headform'!X23=\"Green\",'VRU Headform'!X23=\"D Green\"),\"Green\",'VRU Headform'!X23)))","v":0},{"$f":"IF(NOT('VRU Headform'!Y23=\"Blue\"),IF(OR('VRU Headform'!Y23=\"Red\",'VRU Headform'!Y23=\"D Red\"),\"Red\",IF(OR('VRU Headform'!Y23=\"Green\",'VRU Headform'!Y23=\"D Green\"),\"Green\",'VRU Headform'!Y23)))","v":0},{"$f":"IF(C146=$C$126,\"Yes\",\"No\")","v":"No"}]
[null,"rounded total",{"$f":"ROUND('VRU Headform'!T75,1)","v":0}]
[null,"Max points",18]
[]
[null,"VRU PELVIS"]
[null,"U +10",{"$f":"IF(OR('VRU Upper Legform'!D8=\"N/A\",'VRU Upper Legform'!D8=\"\"),\"\",IF('VRU Upper Legform'!AA8=1,\"Green\",IF('VRU Upper Legform'!AA8>0.75,\"Yellow\",IF('VRU Upper Legform'!AA8>0.5,\"Orange\",IF('VRU Upper Legform'!AA8>0.25,\"Brown\",\"Red\")))))","v":""}]
[null,"U +9",{"$f":"IF(OR('VRU Upper Legform'!D9=\"N/A\",'VRU Upper Legform'!D9=\"\"),\"\",IF('VRU Upper Legform'!AA9=1,\"Green\",IF('VRU Upper Legform'!AA9>0.75,\"Yellow\",IF('VRU Upper Legform'!AA9>0.5,\"Orange\",IF('VRU Upper Legform'!AA9>0.25,\"Brown\",\"Red\")))))","v":""}]
[null,"U +8",{"$f":"IF(OR('VRU Upper Legform'!D10=\"N/A\",'VRU Upper Legform'!D10=\"\"),\"\",IF('VRU Upper Legform'!AA10=1,\"Green\",IF('VRU Upper Legform'!AA10>0.75,\"Yellow\",IF('VRU Upper Legform'!AA10>0.5,\"Orange\",IF('VRU Upper Legform'!AA10>0.25,\"Brown\",\"Red\")))))","v":""}]
[null,"U +7",{"$f":"IF(OR('VRU Upper Legform'!D11=\"N/A\",'VRU Upper Legform'!D11=\"\"),\"\",IF('VRU Upper Legform'!AA11=1,\"Green\",IF('VRU Upper Legform'!AA11>0.75,\"Yellow\",IF('VRU Upper Legform'!AA11>0.5,\"Orange\",IF('VRU Upper Legform'!AA11>0.25,\"Brown\",\"Red\")))))","v":""}]
[null,"U +6",{"$f":"IF(OR('VRU Upper Legform'!D12=\"N/A\",'VRU Upper Legform'!D12=\"\"),\"\",IF('VRU Upper Legform'!AA12=1,\"Green\",IF('VRU Upper Legform'!AA12>0.75,\"Yellow\",IF('VRU Upper Legform'!AA12>0.5,\"Orange\",IF('VRU Upper Legform'!AA12>0.25,\"Brown\",\"Red\")))))","v":""}]
[null,"U +5",{"$f":"IF(OR('VRU Upper Legform'!D13=\"N/A\",'VRU Upper Legform'!D13=\"\"),\"\",IF('VRU Upper Legform'!AA13=1,\"Green\",IF('VRU Upper Legform'!AA13>0.75,\"Yellow\",IF('VRU Upper Legform'!AA13>0.5,\"Orange\",IF('VRU Upper Legform'!AA13>0.25,\"Brown\",\"Red\")))))","v":""}]
[null,"U +4",{"$f":"IF(OR('VRU Upper Legform'!D14=\"N/A\",'VRU Upper Legform'!D14=\"\"),\"\",IF('VRU Upper Legform'!AA14=1,\"Green\",IF('VRU Upper Legform'!AA14>0.75,\"Yellow\",IF('VRU Upper Legform'!AA14>0.5,\"Orange\",IF('VRU Upper Legform'!AA14>0.25,\"Brown\",\"Red\")))))","v":""}]
[null,"U +3",{"$f":"IF(OR('VRU Upper Legform'!D15=\"N/A\",'VRU Upper Legform'!D15=\"\"),\"\",IF('VRU Upper Legform'!AA15=1,\"Green\",IF('VRU Upper Legform'!AA15>0.75,\"Yellow\",IF('VRU Upper Legform'!AA15>0.5,\"Orange\",IF('VRU Upper Legform'!AA15>0.25,\"Brown\",\"Red\")))))","v":""}]
[null,"U +2",{"$f":"IF(OR('VRU Upper Legform'!D16=\"N/A\",'VRU Upper Legform'!D16=\"\"),\"\",IF('VRU Upper Legform'!AA16=1,\"Green\",IF('VRU Upper Legform'!AA16>0.75,\"Yellow\",IF('VRU Upper Legform'!AA16>0.5,\"Orange\",IF('VRU Upper Legform'!AA16>0.25,\"Brown\",\"Red\")))))","v":""}]
[null,"U +1",{"$f":"IF(OR('VRU Upper Legform'!D17=\"N/A\",'VRU Upper Legform'!D17=\"\"),\"\",IF('VRU Upper Legform'!AA17=1,\"Green\",IF('VRU Upper Legform'!AA17>0.75,\"Yellow\",IF('VRU Upper Legform'!AA17>0.5,\"Orange\",IF('VRU Upper Legform'!AA17>0.25,\"Brown\",\"Red\")))))","v":""}]
[null,"U 0",{"$f":"IF(OR('VRU Upper Legform'!D18=\"N/A\",'VRU Upper Legform'!D18=\"\"),\"\",IF('VRU Upper Legform'!AA18=1,\"Green\",IF('VRU Upper Legform'!AA18>0.75,\"Yellow\",IF('VRU Upper Legform'!AA18>0.5,\"Orange\",IF('VRU Upper Legform'!AA18>0.25,\"Brown\",\"Red\")))))","v":""}]
[null,"U -1",{"$f":"IF(OR('VRU Upper Legform'!D19=\"N/A\",'VRU Upper Legform'!D19=\"\"),\"\",IF('VRU Upper Legform'!AA19=1,\"Green\",IF('VRU Upper Legform'!AA19>0.75,\"Yellow\",IF('VRU Upper Legform'!AA19>0.5,\"Orange\",IF('VRU Upper Legform'!AA19>0.25,\"Brown\",\"Red\")))))","v":""}]
[null,"U -2",{"$f":"IF(OR('VRU Upper Legform'!D20=\"N/A\",'VRU Upper Legform'!D20=\"\"),\"\",IF('VRU Upper Legform'!AA20=1,\"Green\",IF('VRU Upper Legform'!AA20>0.75,\"Yellow\",IF('VRU Upper Legform'!AA20>0.5,\"Orange\",IF('VRU Upper Legform'!AA20>0.25,\"Brown\",\"Red\")))))","v":""}]
[null,"U -3",{"$f":"IF(OR('VRU Upper Legform'!D21=\"N/A\",'VRU Upper Legform'!D21=\"\"),\"\",IF('VRU Upper Legform'!AA21=1,\"Green\",IF('VRU Upper Legform'!AA21>0.75,\"Yellow\",IF('VRU Upper Legform'!AA21>0.5,\"Orange\",IF('VRU Upper Legform'!AA21>0.25,\"Brown\",\"Red\")))))","v":""}]
[null,"U -4",{"$f":"IF(OR('VRU Upper Legform'!D22=\"N/A\",'VRU Upper Legform'!D22=\"\"),\"\",IF('VRU Upper Legform'!AA22=1,\"Green\",IF('VRU Upper Legform'!AA22>0.75,\"Yellow\",IF('VRU Upper Legform'!AA22>0.5,\"Orange\",IF('VRU Upper Legform'!AA22>0.25,\"Brown\",\"Red\")))))","v":""}]
[null,"U -5",{"$f":"IF(OR('VRU Upper Legform'!D23=\"N/A\",'VRU Upper Legform'!D23=\"\"),\"\",IF('VRU Upper Legform'!AA23=1,\"Green\",IF('VRU Upper Legform'!AA23>0.75,\"Yellow\",IF('VRU Upper Legform'!AA23>0.5,\"Orange\",IF('VRU Upper Legform'!AA23>0.25,\"Brown\",\"Red\")))))","v":""}]
[null,"U -6",{"$f":"IF(OR('VRU Upper Legform'!D24=\"N/A\",'VRU Upper Legform'!D24=\"\"),\"\",IF('VRU Upper Legform'!AA24=1,\"Green\",IF('VRU Upper Legform'!AA24>0.75,\"Yellow\",IF('VRU Upper Legform'!AA24>0.5,\"Orange\",IF('VRU Upper Legform'!AA24>0.25,\"Brown\",\"Red\")))))","v":""}]
[null,"U -7",{"$f":"IF(OR('VRU Upper Legform'!D25=\"N/A\",'VRU Upper Legform'!D25=\"\"),\"\",IF('VRU Upper Legform'!AA25=1,\"Green\",IF('VRU Upper Legform'!AA25>0.75,\"Yellow\",IF('VRU Upper Legform'!AA25>0.5,\"Orange\",IF('VRU Upper Legform'!AA25>0.25,\"Brown\",\"Red\")))))","v":""}]
[null,"U -8",{"$f":"IF(OR('VRU Upper Legform'!D26=\"N/A\",'VRU Upper Legform'!D26=\"\"),\"\",IF('VRU Upper Legform'!AA26=1,\"Green\",IF('VRU Upper Legform'!AA26>0.75,\"Yellow\",IF('VRU Upper Legform'!AA26>0.5,\"Orange\",IF('VRU Upper Legform'!AA26>0.25,\"Brown\",\"Red\")))))","v":""}]
[null,"U -9",{"$f":"IF(OR('VRU Upper Legform'!D27=\"N/A\",'VRU Upper Legform'!D27=\"\"),\"\",IF('VRU Upper Legform'!AA27=1,\"Green\",IF('VRU Upper Legform'!AA27>0.75,\"Yellow\",IF('VRU Upper Legform'!AA27>0.5,\"Orange\",IF('VRU Upper Legform'!AA27>0.25,\"Brown\",\"Red\")))))","v":""}]
[null,"U -10",{"$f":"IF(OR('VRU Upper Legform'!D28=\"N/A\",'VRU Upper Legform'!D28=\"\"),\"\",IF('VRU Upper Legform'!AA28=1,\"Green\",IF('VRU Upper Legform'!AA28>0.75,\"Yellow\",IF('VRU Upper Legform'!AA28>0.5,\"Orange\",IF('VRU Upper Legform'!AA28>0.25,\"Brown\",\"Red\")))))","v":""}]
[null,"ROUNDED TOTAL",{"$f":"ROUND('VRU Upper Legform'!G35,1)","v":0}]
[null,"MAX POINTS",4.5]
[]
[null,"VRU FEMUR"]
[null,"L +10",{"$f":"IF(OR('VRU Legform'!D8=\"N/A\",'VRU Legform'!D8=\"\"),\"\",IF('VRU Legform'!AG8=1,\"Green\",IF('VRU Legform'!AG8>0.75,\"Yellow\",IF('VRU Legform'!AG8>0.5,\"Orange\",IF('VRU Legform'!AG8>0.25,\"Brown\",\"Red\")))))","v":""}]
[null,"L +9",{"$f":"IF(OR('VRU Legform'!D9=\"N/A\",'VRU Legform'!D9=\"\"),\"\",IF('VRU Legform'!AG9=1,\"Green\",IF('VRU Legform'!AG9>0.75,\"Yellow\",IF('VRU Legform'!AG9>0.5,\"Orange\",IF('VRU Legform'!AG9>0.25,\"Brown\",\"Red\")))))","v":""}]
[null,"L +8",{"$f":"IF(OR('VRU Legform'!D10=\"N/A\",'VRU Legform'!D10=\"\"),\"\",IF('VRU Legform'!AG10=1,\"Green\",IF('VRU Legform'!AG10>0.75,\"Yellow\",IF('VRU Legform'!AG10>0.5,\"Orange\",IF('VRU Legform'!AG10>0.25,\"Brown\",\"Red\")))))","v":""}]
[null,"L +7",{"$f":"IF(OR('VRU Legform'!D11=\"N/A\",'VRU Legform'!D11=\"\"),\"\",IF('VRU Legform'!AG11=1,\"Green\",IF('VRU Legform'!AG11>0.75,\"Yellow\",IF('VRU Legform'!AG11>0.5,\"Orange\",IF('VRU Legform'!AG11>0.25,\"Brown\",\"Red\")))))","v":""}]
[null,"L +6",{"$f":"IF(OR('VRU Legform'!D12=\"N/A\",'VRU Legform'!D12=\"\"),\"\",IF('VRU Legform'!AG12=1,\"Green\",IF('VRU Legform'!AG12>0.75,\"Yellow\",IF('VRU Legform'!AG12>0.5,\"Orange\",IF('VRU Legform'!AG12>0.25,\"Brown\",\"Red\")))))","v":""}]
[null,"L +5",{"$f":"IF(OR('VRU Legform'!D13=\"N/A\",'VRU Legform'!D13=\"\"),\"\",IF('VRU Legform'!AG13=1,\"Green\",IF('VRU Legform'!AG13>0.75,\"Yellow\",IF('VRU Legform'!AG13>0.5,\"Orange\",IF('VRU Legform'!AG13>0.25,\"Brown\",\"Red\")))))","v":""}]
[null,"L +4",{"$f":"IF(OR('VRU Legform'!D14=\"N/A\",'VRU Legform'!D14=\"\"),\"\",IF('VRU Legform'!AG14=1,\"Green\",IF('VRU Legform'!AG14>0.75,\"Yellow\",IF('VRU Legform'!AG14>0.5,\"Orange\",IF('VRU Legform'!AG14>0.25,\"Brown\",\"Red\")))))","v":""}]
[null,"L +3",{"$f":"IF(OR('VRU Legform'!D15=\"N/A\",'VRU Legform'!D15=\"\"),\"\",IF('VRU Legform'!AG15=1,\"Green\",IF('VRU Legform'!AG15>0.75,\"Yellow\",IF('VRU Legform'!AG15>0.5,\"Orange\",IF('VRU Legform'!AG15>0.25,\"Brown\",\"Red\")))))","v":""}]
[null,"L +2",{"$f":"IF(OR('VRU Legform'!D16=\"N/A\",'VRU Legform'!D16=\"\"),\"\",IF('VRU Legform'!AG16=1,\"Green\",IF('VRU Legform'!AG16>0.75,\"Yellow\",IF('VRU Legform'!AG16>0.5,\"Orange\",IF('VRU Legform'!AG16>0.25,\"Brown\",\"Red\")))))","v":""}]
[null,"L +1",{"$f":"IF(OR('VRU Legform'!D17=\"N/A\",'VRU Legform'!D17=\"\"),\"\",IF('VRU Legform'!AG17=1,\"Green\",IF('VRU Legform'!AG17>0.75,\"Yellow\",IF('VRU Legform'!AG17>0.5,\"Orange\",IF('VRU Legform'!AG17>0.25,\"Brown\",\"Red\")))))","v":""}]
[null,"L 0",{"$f":"IF(OR('VRU Legform'!D18=\"N/A\",'VRU Legform'!D18=\"\"),\"\",IF('VRU Legform'!AG18=1,\"Green\",IF('VRU Legform'!AG18>0.75,\"Yellow\",IF('VRU Legform'!AG18>0.5,\"Orange\",IF('VRU Legform'!AG18>0.25,\"Brown\",\"Red\")))))","v":""}]
[null,"L -1",{"$f":"IF(OR('VRU Legform'!D19=\"N/A\",'VRU Legform'!D19=\"\"),\"\",IF('VRU Legform'!AG19=1,\"Green\",IF('VRU Legform'!AG19>0.75,\"Yellow\",IF('VRU Legform'!AG19>0.5,\"Orange\",IF('VRU Legform'!AG19>0.25,\"Brown\",\"Red\")))))","v":""}]
[null,"L -2",{"$f":"IF(OR('VRU Legform'!D20=\"N/A\",'VRU Legform'!D20=\"\"),\"\",IF('VRU Legform'!AG20=1,\"Green\",IF('VRU Legform'!AG20>0.75,\"Yellow\",IF('VRU Legform'!AG20>0.5,\"Orange\",IF('VRU Legform'!AG20>0.25,\"Brown\",\"Red\")))))","v":""}]
[null,"L -3",{"$f":"IF(OR('VRU Legform'!D21=\"N/A\",'VRU Legform'!D21=\"\"),\"\",IF('VRU Legform'!AG21=1,\"Green\",IF('VRU Legform'!AG21>0.75,\"Yellow\",IF('VRU Legform'!AG21>0.5,\"Orange\",IF('VRU Legform'!AG21>0.25,\"Brown\",\"Red\")))))","v":""}]
[null,"L -4",{"$f":"IF(OR('VRU Legform'!D22=\"N/A\",'VRU Legform'!D22=\"\"),\"\",IF('VRU Legform'!AG22=1,\"Green\",IF('VRU Legform'!AG22>0.75,\"Yellow\",IF('VRU Legform'!AG22>0.5,\"Orange\",IF('VRU Legform'!AG22>0.25,\"Brown\",\"Red\")))))","v":""}]
[null,"L -5",{"$f":"IF(OR('VRU Legform'!D23=\"N/A\",'VRU Legform'!D23=\"\"),\"\",IF('VRU Legform'!AG23=1,\"Green\",IF('VRU Legform'!AG23>0.75,\"Yellow\",IF('VRU Legform'!AG23>0.5,\"Orange\",IF('VRU Legform'!AG23>0.25,\"Brown\",\"Red\")))))","v":""}]
[null,"L -6",{"$f":"IF(OR('VRU Legform'!D24=\"N/A\",'VRU Legform'!D24=\"\"),\"\",IF('VRU Legform'!AG24=1,\"Green\",IF('VRU Legform'!AG24>0.75,\"Yellow\",IF('VRU Legform'!AG24>0.5,\"Orange\",IF('VRU Legform'!AG24>0.25,\"Brown\",\"Red\")))))","v":""}]
[null,"L -7",{"$f":"IF(OR('VRU Legform'!D25=\"N/A\",'VRU Legform'!D25=\"\"),\"\",IF('VRU Legform'!AG25=1,\"Green\",IF('VRU Legform'!AG25>0.75,\"Yellow\",IF('VRU Legform'!AG25>0.5,\"Orange\",IF('VRU Legform'!AG25>0.25,\"Brown\",\"Red\")))))","v":""}]
[null,"L -8",{"$f":"IF(OR('VRU Legform'!D26=\"N/A\",'VRU Legform'!D26=\"\"),\"\",IF('VRU Legform'!AG26=1,\"Green\",IF('VRU Legform'!AG26>0.75,\"Yellow\",IF('VRU Legform'!AG26>0.5,\"Orange\",IF('VRU Legform'!AG26>0.25,\"Brown\",\"Red\")))))","v":""}]
[null,"L -9",{"$f":"IF(OR('VRU Legform'!D27=\"N/A\",'VRU Legform'!D27=\"\"),\"\",IF('VRU Legform'!AG27=1,\"Green\",IF('VRU Legform'!AG27>0.75,\"Yellow\",IF('VRU Legform'!AG27>0.5,\"Orange\",IF('VRU Legform'!AG27>0.25,\"Brown\",\"Red\")))))","v":""}]
[null,"L -10",{"$f":"IF(OR('VRU Legform'!D28=\"N/A\",'VRU Legform'!D28=\"\"),\"\",IF('VRU Legform'!AG28=1,\"Green\",IF('VRU Legform'!AG28>0.75,\"Yellow\",IF('VRU Legform'!AG28>0.5,\"Orange\",IF('VRU Legform'!AG28>0.25,\"Brown\",\"Red\")))))","v":""}]
[null,"ROUNDED TOTAL",{"$f":"ROUND('VRU Legform'!E32,1)","v":0}]
[null,"MAX POINTS","4.5"]
[]
[null,"VRU KNEE TIBIA"]
[null,"L +10",{"$f":"IF(OR('VRU Legform'!D8=\"N/A\",'VRU Legform'!D8=\"\"),\"\",IF('VRU Legform'!AF8=1,\"Green\",IF('VRU Legform'!AF8>0.75,\"Yellow\",IF('VRU Legform'!AF8>0.5,\"Orange\",IF('VRU Legform'!AF8>0.25,\"Brown\",\"Red\")))))","v":""}]
[null,"L +9",{"$f":"IF(OR('VRU Legform'!D9=\"N/A\",'VRU Legform'!D9=\"\"),\"\",IF('VRU Legform'!AF9=1,\"Green\",IF('VRU Legform'!AF9>0.75,\"Yellow\",IF('VRU Legform'!AF9>0.5,\"Orange\",IF('VRU Legform'!AF9>0.25,\"Brown\",\"Red\")))))","v":""}]
[null,"L +8",{"$f":"IF(OR('VRU Legform'!D10=\"N/A\",'VRU Legform'!D10=\"\"),\"\",IF('VRU Legform'!AF10=1,\"Green\",IF('VRU Legform'!AF10>0.75,\"Yellow\",IF('VRU Legform'!AF10>0.5,\"Orange\",IF('VRU Legform'!AF10>0.25,\"Brown\",\"Red\")))))","v":""}]
[null,"L +7",{"$f":"IF(OR('VRU Legform'!D11=\"N/A\",'VRU Legform'!D11=\"\"),\"\",IF('VRU Legform'!AF11=1,\"Green\",IF('VRU Legform'!AF11>0.75,\"Yellow\",IF('VRU Legform'!AF11>0.5,\"Orange\",IF('VRU Legform'!AF11>0.25,\"Brown\",\"Red\")))))","v":""}]
[null,"L +6",{"$f":"IF(OR('VRU Legform'!D12=\"N/A\",'VRU Legform'!D12=\"\"),\"\",IF('VRU Legform'!AF12=1,\"Green\",IF('VRU Legform'!AF12>0.75,\"Yellow\",IF('VRU Legform'!AF12>0.5,\"Orange\",IF('VRU Legform'!AF12>0.25,\"Brown\",\"Red\")))))","v":""}]
[null,"L +5",{"$f":"IF(OR('VRU Legform'!D13=\"N/A\",'VRU Legform'!D13=\"\"),\"\",IF('VRU Legform'!AF13=1,\"Green\",IF('VRU Legform'!AF13>0.75,\"Yellow\",IF('VRU Legform'!AF13>0.5,\"Orange\",IF('VRU Legform'!AF13>0.25,\"Brown\",\"Red\")))))","v":""}]
[null,"L +4",{"$f":"IF(OR('VRU Legform'!D14=\"N/A\",'VRU Legform'!D14=\"\"),\"\",IF('VRU Legform'!AF14=1,\"Green\",IF('VRU Legform'!AF14>0.75,\"Yellow\",IF('VRU Legform'!AF14>0.5,\"Orange\",IF('VRU Legform'!AF14>0.25,\"Brown\",\"Red\")))))","v":""}]
[null,"L +3",{"$f":"IF(OR('VRU Legform'!D15=\"N/A\",'VRU Legform'!D15=\"\"),\"\",IF('VRU Legform'!AF15=1,\"Green\",IF('VRU Legform'!AF15>0.75,\"Yellow\",IF('VRU Legform'!AF15>0.5,\"Orange\",IF('VRU Legform'!AF15>0.25,\"Brown\",\"Red\")))))","v":""}]
[null,"L +2",{"$f":"IF(OR('VRU Legform'!D16=\"N/A\",'VRU Legform'!D16=\"\"),\"\",IF('VRU Legform'!AF16=1,\"Green\",IF('VRU Legform'!AF16>0.75,\"Yellow\",IF('VRU Legform'!AF16>0.5,\"Orange\",IF('VRU Legform'!AF16>0.25,\"Brown\",\"Red\")))))","v":""}]
[null,"L +1",{"$f":"IF(OR('VRU Legform'!D17=\"N/A\",'VRU Legform'!D17=\"\"),\"\",IF('VRU Legform'!AF17=1,\"Green\",IF('VRU Legform'!AF17>0.75,\"Yellow\",IF('VRU Legform'!AF17>0.5,\"Orange\",IF('VRU Legform'!AF17>0.25,\"Brown\",\"Red\")))))","v":""}]
[null,"L 0",{"$f":"IF(OR('VRU Legform'!D18=\"N/A\",'VRU Legform'!D18=\"\"),\"\",IF('VRU Legform'!AF18=1,\"Green\",IF('VRU Legform'!AF18>0.75,\"Yellow\",IF('VRU Legform'!AF18>0.5,\"Orange\",IF('VRU Legform'!AF18>0.25,\"Brown\",\"Red\")))))","v":""}]
[null,"L -1",{"$f":"IF(OR('VRU Legform'!D19=\"N/A\",'VRU Legform'!D19=\"\"),\"\",IF('VRU Legform'!AF19=1,\"Green\",IF('VRU Legform'!AF19>0.75,\"Yellow\",IF('VRU Legform'!AF19>0.5,\"Orange\",IF('VRU Legform'!AF19>0.25,\"Brown\",\"Red\")))))","v":""}]
[null,"L -2",{"$f":"IF(OR('VRU Legform'!D20=\"N/A\",'VRU Legform'!D20=\"\"),\"\",IF('VRU Legform'!AF20=1,\"Green\",IF('VRU Legform'!AF20>0.75,\"Yellow\",IF('VRU Legform'!AF20>0.5,\"Orange\",IF('VRU Legform'!AF20>0.25,\"Brown\",\"Red\")))))","v":""}]
[null,"L -3",{"$f":"IF(OR('VRU Legform'!D21=\"N/A\",'VRU Legform'!D21=\"\"),\"\",IF('VRU Legform'!AF21=1,\"Green\",IF('VRU Legform'!AF21>0.75,\"Yellow\",IF('VRU Legform'!AF21>0.5,\"Orange\",IF('VRU Legform'!AF21>0.25,\"Brown\",\"Red\")))))","v":""}]
[null,"L -4",{"$f":"IF(OR('VRU Legform'!D22=\"N/A\",'VRU Legform'!D22=\"\"),\"\",IF('VRU Legform'!AF22=1,\"Green\",IF('VRU Legform'!AF22>0.75,\"Yellow\",IF('VRU Legform'!AF22>0.5,\"Orange\",IF('VRU Legform'!AF22>0.25,\"Brown\",\"Red\")))))","v":""}]
[null,"L -5",{"$f":"IF(OR('VRU Legform'!D23=\"N/A\",'VRU Legform'!D23=\"\"),\"\",IF('VRU Legform'!AF23=1,\"Green\",IF('VRU Legform'!AF23>0.75,\"Yellow\",IF('VRU Legform'!AF23>0.5,\"Orange\",IF('VRU Legform'!AF23>0.25,\"Brown\",\"Red\")))))","v":""}]
[null,"L -6",{"$f":"IF(OR('VRU Legform'!D24=\"N/A\",'VRU Legform'!D24=\"\"),\"\",IF('VRU Legform'!AF24=1,\"Green\",IF('VRU Legform'!AF24>0.75,\"Yellow\",IF('VRU Legform'!AF24>0.5,\"Orange\",IF('VRU Legform'!AF24>0.25,\"Brown\",\"Red\")))))","v":""}]
[null,"L -7",{"$f":"IF(OR('VRU Legform'!D25=\"N/A\",'VRU Legform'!D25=\"\"),\"\",IF('VRU Legform'!AF25=1,\"Green\",IF('VRU Legform'!AF25>0.75,\"Yellow\",IF('VRU Legform'!AF25>0.5,\"Orange\",IF('VRU Legform'!AF25>0.25,\"Brown\",\"Red\")))))","v":""}]
[null,"L -8",{"$f":"IF(OR('VRU Legform'!D26=\"N/A\",'VRU Legform'!D26=\"\"),\"\",IF('VRU Legform'!AF26=1,\"Green\",IF('VRU Legform'!AF26>0.75,\"Yellow\",IF('VRU Legform'!AF26>0.5,\"Orange\",IF('VRU Legform'!AF26>0.25,\"Brown\",\"Red\")))))","v":""}]
[null,"L -9",{"$f":"IF(OR('VRU Legform'!D27=\"N/A\",'VRU Legform'!D27=\"\"),\"\",IF('VRU Legform'!AF27=1,\"Green\",IF('VRU Legform'!AF27>0.75,\"Yellow\",IF('VRU Legform'!AF27>0.5,\"Orange\",IF('VRU Legform'!AF27>0.25,\"Brown\",\"Red\")))))","v":""}]
[null,"L -10",{"$f":"IF(OR('VRU Legform'!D28=\"N/A\",'VRU Legform'!D28=\"\"),\"\",IF('VRU Legform'!AF28=1,\"Green\",IF('VRU Legform'!AF28>0.75,\"Yellow\",IF('VRU Legform'!AF28>0.5,\"Orange\",IF('VRU Legform'!AF28>0.25,\"Brown\",\"Red\")))))","v":""}]
[null,"ROUNDED TOTAL",{"$f":"ROUND('VRU Legform'!E36,1)","v":0}]
[null,"MAX POINTS",9]
[]
[null,null,"Day/AEB",null,"Night/FCW"]
[null,"VRU Impact Mitigation","Score","Colour","Score","Colour","Comment","Max Points"]
[null,"AEB Pedestrian",{"$f":"ROUND('OVERALL RATING'!H11,1)","v":0},{"$f":"Colour_ADAS('OVERALL RATING'!H11/9)","v":"Red"},null,null,null,9]
[null,"Car Reversing into adult or child",null,{"$f":"Colour_ADAS('VRU AEB Pedestrian'!G91/2)","v":"Red"},null,null,null,null,"CPRA"]
[null,"Adult crossing a road into which a car is turning",null,{"$f":"Colour_ADAS('VRU AEB Pedestrian'!G90/2)","v":"Red"},null,null,null,null,"CPTA"]
[null,"Adult crossing the road",null,{"$f":"Colour_ADAS(SUM('VRU AEB Pedestrian'!G85:G87)/0.5)","v":"Red"},null,{"$f":"Colour_ADAS(SUM('VRU AEB Pedestrian'!M85:M87)/1.5)","v":"Red"},null,null,"CPFA & CPNA"]
[null,"Child running from behind parked vehicles",null,{"$f":"Colour_ADAS('VRU AEB Pedestrian'!G88/1)","v":"Red"},null,{"$f":"Colour_ADAS('VRU AEB Pedestrian'!M88/0.5)","v":"Red"},null,null,"CPNCO"]
[null,"Adult along the roadside",null,{"$f":"Colour_ADAS('VRU AEB Pedestrian'!G90/0.5)","v":"Red"},null,{"$f":"Colour_ADAS('VRU AEB Pedestrian'!M89/1)","v":"Red"},null,null,"CPLA"]
[null,"AEB Cyclist",{"$f":"ROUND(SUM('VRU AEB Bicyclist'!G68:G72),1)","v":0},{"$f":"Colour_ADAS(SUM('VRU AEB Bicyclist'!G68:G72)/8)","v":"Red"},null,null,null,8]
[null,"Approaching a cyclist crossing from behind parked vehicles",null,{"$f":"Colour_ADAS('VRU AEB Bicyclist'!G70/1)","v":"Red"}]
[null,"Turning across the path of an oncoming cyclist",null,{"$f":"Colour_ADAS('VRU AEB Bicyclist'!G72/2)","v":"Red"}]
[null,"Approaching a crossing cyclist",null,{"$f":"Colour_ADAS(SUM('VRU AEB Bicyclist'!G68:G70)/4)","v":"Red"}]
[null,"Approaching a cyclist along the roadside",null,{"$f":"Colour_ADAS('VRU AEB Bicyclist'!G71/2)","v":"Red"}]
[null,"Cyclist Dooring Prevention",{"$f":"ROUND('VRU AEB Bicyclist'!G73,1)","v":0},{"$f":"Colour_ADAS('VRU AEB Bicyclist'!G73/1)","v":"Red"},null,null,null,1]
[null,"Dooring a passing cyclist 2023",null,null,null,null,"Information"]
[null,"AEB Motorcyclist",{"$f":"ROUND(SUM('VRU AEB Motorcyclist'!G58:G59,'VRU AEB Motorcyclist'!G61:G62,'VRU AEB Motorcyclist'!G64:I66),1)","v":0},{"$f":"Colour_ADAS(SUM('VRU AEB Motorcyclist'!G58:G59,'VRU AEB Motorcyclist'!G61:G62,'VRU AEB Motorcyclist'!G64:I66)/6)","v":"Red"},null,null,null,6]
[null,"Approaching a stationary motorcyclist 2023",null,{"$f":"Colour_ADAS('VRU AEB Motorcyclist'!G58/1)","v":"Red"},null,{"$f":"Colour_ADAS('VRU AEB Motorcyclist'!G59/0.5)","v":"Red"}]
[null,"Approaching a braking motorcyclist 2023",null,{"$f":"Colour_ADAS(SUM('VRU AEB Motorcyclist'!G61,'VRU AEB Motorcyclist'!G64)/1)","v":"Red"},null,{"$f":"Colour_ADAS(SUM('VRU AEB Motorcyclist'!G62,'VRU AEB Motorcyclist'!G65)/0.5)","v":"Red"}]
[null,"Turning across the path of an oncoming motorcyclist",null,{"$f":"Colour_ADAS('VRU AEB Motorcyclist'!G66/3)","v":"Red"}]
[null,"Lane Support Motorcyclist",{"$f":"ROUND(SUM('VRU AEB Motorcyclist'!G67:G68),1)","v":0},{"$f":"Colour_ADAS(SUM('VRU AEB Motorcyclist'!G67:G68)/3)","v":"Red"},null,null,null,3,"CM oncoming and CM overtaking"]
[null,"Changing lane across path of oncoming m-cyclist",null,{"$f":"Colour_ADAS('VRU AEB Motorcyclist'!G67/2)","v":"Red"}]
[null,"Chaning lane across path of overtaking m-cyclist",null,{"$f":"Colour_ADAS('VRU AEB Motorcyclist'!G68/1)","v":"Red"}]
[]
[]
[]
[null,"SAFETY ASSIST"]
[null,"SAS"]
[null,"rounded total",{"$f":"ROUND('SA SAS'!D72,1)","v":0},{"$f":"'SA SAS'!D72/Datasheet!C253","v":0},null,null,null,null,null,"Speed Limitation Function"]
[null,"max points",3,null,null,null,null,null,null,"Intelligent Speed Limiter, not default ON"]
[null,"colour",{"$f":"IF(D252>=0.75,\"Green\",IF(D252>=0.5,\"Yellow\",IF(D252>=0.25,\"Orange\",IF(D252>0,\"Brown\",\"Red\"))))","v":"Red"},null,null,null,null,null,null,"Intelligent Speed Limiter, default ON"]
[null,"description",{"$f":"CONCATENATE('SA SAS'!D9,Datasheet!D255)","v":""},{"$f":"IF(OR('SA SAS'!D17:D26=\"Pass\"),\", subsigns supported\",\"\")","v":""},null,null,null,null,null,"Intelligent ACC"]
[null,"Accuracy",{"$f":"CONCATENATE('SA SAS'!D55,Datasheet!D256)","v":""},{"$f":"IF(AND('SA SAS'!D59<=5,'SA SAS'!D62<=5,'SA SAS'!D65<=5),\" (accurate to 5km/h)\",IF(AND('SA SAS'!D59<=10,'SA SAS'!D62<=10,'SA SAS'!D65<=10),\" (accurate to 10km/h)\",\"\"))","v":""}]
[]
[]
[null,"LSS"]
[null,"rounded total",{"$f":"ROUND('SA LSS'!D78,1)","v":0},{"$f":"'SA LSS'!D78/C261","v":0},null,null,null,null,null,null,null,null,null,null,null,10]
[null,"max points",3,null,null,null,null,null,null,null,null,null,null,null,null,{"$f":"P260+26.67","v":36.67}]
[null,"colour",{"$f":"IF(D260>=0.75,\"Green\",IF(D260>=0.5,\"Yellow\",IF(D260>=0.25,\"Orange\",IF(D260>0,\"Brown\",\"Red\"))))","v":"Red"},null,null,null,null,null,null,null,null,null,null,null,null,{"$f":"P261+26.67","v":63.34}]
[null,"ELK_rounded",{"$f":"ROUND('SA LSS'!D55,1)","v":0},null,null,null,null,null,null,null,null,null,null,null,null,{"$f":"P262+26.67","v":90.01}]
[null,"ELK_Max",2,{"$f":"'SA LSS'!D55/Datasheet!C264","v":0}]
[null,"ELK_colour",{"$f":"IF(D264>=0.75,\"Green\",IF(D264>=0.5,\"Yellow\",IF(D264>=0.25,\"Orange\",IF(D264>0,\"Brown\",\"Red\"))))","v":"Red"}]
[null,"LKA_rounded",{"$f":"ROUND('SA LSS'!D66,1)","v":0}]
[null,"LKA_Max",0.5]
[null,"LKA_colour",{"$f":"IF('SA LSS'!D66=0.5,\"Green\",IF('SA LSS'!D66=0.25,\"Orange\",\"Red\"))","v":"Red"}]
[null,"HMI_rounded",{"$f":"ROUND('SA LSS'!D71,1)","v":0}]
[null,"HMI_Max",0.5]
[null,"HMI_colour",{"$f":"IF(C269=0.5,\"Green\",IF(C269=0.25,\"Orange\",\"Red\"))","v":"Red"}]
[]
[null,null,null,null,null,null,0]
[null,null,null,null,null,null,1,"Autonomous emergency braking"]
[null,"AEB",null,null,null,null,2,"Forward collision warning"]
[null,"rounded_total",{"$f":"ROUND('SA AEB Car-to-Car'!D135,1)","v":0},null,null,null,3,"Autonomous emergency braking and forward collision warning"]
[null,"Max points",9,{"$f":"'SA AEB Car-to-Car'!D135/C277","v":0}]
[null,"colour",{"$f":"Colour_ADAS(D277)","v":"Red"}]
[null,"additional information",{"$f":"VLOOKUP(F279,G279:H284,2)","v":"No supplementary warning or dynamic seatbelt retractors"},{"$f":"IF('SA AEB Car-to-Car'!D117=\"Yes\",1,0)","v":0},{"$f":"IF('SA AEB Car-to-Car'!D118=\"Yes\",2,0)","v":0},{"$f":"SUM(D279:E279)","v":0},0,"No supplementary warning or dynamic seatbelt retractors"]
[null,"min speed",{"$f":"MIN('SA AEB Car-to-Car'!D8,'SA AEB Car-to-Car'!I8)","v":0},{"$f":"IF('SA AEB Car-to-Car'!D7=\"Yes\",1,0)","v":0},{"$f":"IF('SA AEB Car-to-Car'!I7=\"Yes\",2,0)","v":0},{"$f":"SUM(D280:E280)","v":0},1,"Supplementary warning"]
[null,"functionality",{"$f":"IF(F280=0,\"\",VLOOKUP(F280,G274:H276,2))","v":""},{"$f":"C281","v":""}]
[null,"Sensors used","camera and radar",null,null,null,2,"Dynamic seatbelt retractors"]
[]
[null,null,null,null,null,null,3,"Supplementary warning and dynamic seatbelt retractors"]
[null,null,"AEB Score","Autobrake","FCW Score","Driver reacts","Comment","Max"]
[null,"AEB Car to Car",{"$f":"ROUND('OVERALL RATING'!J9,1)","v":0},{"$f":"Colour_ADAS('OVERALL RATING'!J9/9)","v":"Red"},null,null,null,9]
[null,"Approaching a car crossing a junction",null,{"$f":"Colour_ADAS('SA AEB Car-to-Car'!D126)","v":"Red"},null,{"$f":"Colour_ADAS('SA AEB Car-to-Car'!I126)","v":"Red"}]
[null,"Approaching a car head-on",null,{"$f":"Colour_ADAS('SA AEB Car-to-Car'!D127)","v":"Red"}]
[null,"Turning across the path of an oncoming car",null,{"$f":"Colour_ADAS('SA AEB Car-to-Car'!D125)","v":"Red"}]
[null,"Approaching a stationary car",null,{"$f":"Colour_ADAS('SA AEB Car-to-Car'!D122)","v":"Red"},null,{"$f":"Colour_ADAS('SA AEB Car-to-Car'!I122)","v":"Red"}]
[null,"Approaching a slower moving car",null,{"$f":"Colour_ADAS('SA AEB Car-to-Car'!D123)","v":"Red"}]
[null,"Approaching a braking car",null,{"$f":"Colour_ADAS('SA AEB Car-to-Car'!D124)","v":"Red"}]
[null,null,null,null,null,null,null,null,null,null,null,null,null,null,null,null,null,null,null,null,null,null,null,null,null,null,null,null,"Sliding"]
[null,null,null,null,null,null,null,null,null,null,null,null,null,null,null,null,null,null,null,null,null,null,null,null,null,null,null,null,"Conventional"]
[null,"OSM"]
[null,"colour",{"$f":"Colour_ADAS(D296)","v":"Red"},{"$f":"C297/C298","v":0}]
[null,"rounded_total_OSM",{"$f":"ROUND('SA OSM'!D51,1)","v":0}]
[null,"MAX_points_OSM",3]
[null,"SBR_applies to",{"$f":"VLOOKUP(G299,I299:J303,2)","v":"No seats"},{"$f":"IF(AND('General Overview'!E64:F64=\"Standard\"),1,0)","v":0},{"$f":"IF('General Overview'!G64=\"standard\",2,0)","v":0},{"$f":"IF('General Overview'!H64=\"standard\",4,0)","v":0},{"$f":"SUM(D299:F299)","v":0},null,0,"No seats"]
[null,"SBR_rounded_total",{"$f":"ROUND('SA OSM'!D48,1)","v":0},null,null,null,null,null,1,"Front seats only"]
[null,"SBR_Max",1,null,null,null,null,null,3,"Front and rear seats"]
[null,"SBR_Colour",{"$f":"Colour_ADAS(C300/C301)","v":"Red"},null,null,null,null,null,5,{"$f":"CONCATENATE(\"Front and \",IF('General Overview'!E18=\"Optional\",\"optional \",\"\"),\"third row seats\")","v":"Front and third row seats"}]
[null,"Driver_Monitoring_rounded",{"$f":"ROUND('SA OSM'!D49,1)","v":{"$error":"#VALUE!"}},null,null,null,null,null,7,{"$f":"CONCATENATE(\"Front and rear seats, including \",IF('General Overview'!E18=\"Optional\",\"optional \",\"\"),\"third row\")","v":"Front and rear seats, including third row"}]
[null,"Driver_monitoring_MAX","2"]
["---->>","Driver_monitoring_colour",{"$f":"IF(OR('General Overview'!E65=\"Not available\",'General Overview'!E65=\"Optional not meeting fitment\"),\"Grey\",Colour_ADAS(C303/C304))","v":{"$error":"#VALUE!"}},{"$f":"C305","v":{"$error":"#VALUE!"}}]
["---->>","Dr Monitor Name","Driver_Check"]
["---->>","Type",{"$f":"IF('SA OSM'!D14=\"Direct\",\"Direct eye monitoring\",IF('SA OSM'!D14=\"Indirect\",\"Indirect monitoring\",\"-\"))","v":"-"}]
["---->>","Min Speed",30]
[null,"Fatigue Comment",{"$f":"VLOOKUP(G309,I309:J316,2)","v":"-"},{"$f":"IF('SA OSM'!G39=\"Yes\",1,0)","v":0},{"$f":"IF('SA OSM'!G40=\"Yes\",2,0)","v":0},{"$f":"IF('SA OSM'!G41=\"Yes\",4,0)","v":0},{"$f":"SUM(D309:F309)","v":0},null,0,"-",null,null,null,0,"-"]
[null,"Distraction Comment",{"$f":"VLOOKUP(G310,N309:O316,2)","v":"-"},{"$f":"IF(OR('SA OSM'!G26:G30=\"Yes\"),1,0)","v":0},{"$f":"IF(OR('SA OSM'!G31:G35=\"Yes\"),2,0)","v":0},{"$f":"IF(OR('SA OSM'!G36:G38=\"Yes\"),4,0)","v":0},{"$f":"SUM(D310:F310)","v":0},null,1,"Drowsiness",null,null,null,1,"Long Distraction"]
[null,"Impairment Comment",{"$f":"IF('SA OSM'!H42=\"Yes\",\"Unresponsive Driver\",\"-\")","v":"-"},null,null,null,null,null,2,"Microsleep",null,null,null,2,"Short Distraction"]
[null,null,null,null,null,null,null,null,3,"Drowsiness and Microsleep",null,null,null,3,"Long and Short Distraction"]
[null,null,null,null,null,null,null,null,4,"Sleep",null,null,null,4,"Phone Use"]
[null,null,null,null,null,null,null,null,5,"Drowsiness and Sleep",null,null,null,5,"Long Distraction and Phone Use"]
[null,null,null,null,null,null,null,null,6,"Microsleep and Sleep",null,null,null,6,"Short Distraction and Phone Use"]
[null,null,null,null,null,null,null,null,7,"Drowsiness, Microsleep and Sleep",null,null,null,7,"Long & Short Distraction and Phone Use"]
[]
[]
[]
[]
[]
[]
[]
[]
[]
[]
[]
[]
[]
[]
[]
[]
[]
[]
[]
[]
[]
[]
[]
[]
[]
[]
[]
[]
[]
[]
[]
[]
[]
[]
[]
[]
[]
[]
[]
[]
[]
[]
[]
[]
[]
[]
[]
[]
[]
[]
[]
[]
[]
[]
[]
[]
[]
[]
[]
[]
[]
[]
[]
[]
[]
[]
[]
[]
[]
[]
[]
[]
[]
[]
[]
[]
[]
[]
[]
[]
[]
[]
[]
[]
[]
[]
[]
[]
[]
[]
[]
[]
[]
[]
[]
[]
[]
[]
[]
[]
[]
[]
[]
[]
[]
[]
[]
[]
[]
[]
[]
[]
[]
[]
[]
[]
[]
[]
[]
[]
[]
[]
[]
[]
[]
[]
[]
[]
[]
[]
[]
[]
[]
[]
[]
[]
[]
[]
[]
[]
[null,"AOP"]
[null,"Pass Cell Stability",{"$f":"IF('AOP Frontal MPDB'!D50<>-1,\"The passenger compartment of the \"&'General Overview'!C5&\" remained stable in the frontal offset test.\",\"PASS CELL STABILITY\")","v":"The passenger compartment of the  remained stable in the frontal offset test."}]
[null,"KFP dummy numbers",{"$f":"IF(AND('AOP Frontal MPDB'!E60:E61=4,'AOP Frontal MPDB'!G60:G61=4,'AOP Frontal MPDB'!E67:E68=4,'AOP Frontal MPDB'!G67:G68=4),\"Dummy numbers showed good protection of the knees and femurs of both the driver and passenger.\",\"KFP READINGS\")","v":"KFP READINGS"}]
[null,"KFP mods",{"$f":"IF(AND('AOP Frontal MPDB'!D63:D64=0,'AOP Frontal MPDB'!F63:F64=0,'AOP Frontal MPDB'!D70:D71=0,'AOP Frontal MPDB'!F70:F71=0),'General Overview'!C4&\" showed that a similar level of protection would be provided to occupants of different sizes and to those sitting in different positions.\",\"KFP MODS\")","v":" showed that a similar level of protection would be provided to occupants of different sizes and to those sitting in different positions."}]
[null,"Anything < adequate?",{"$f":"IF(C22=TRUE,\"SOMETHING LESS THAN ADEQUATE\",\"\")","v":"SOMETHING LESS THAN ADEQUATE"}]
[null,"Compatibility",{"$f":"\"Analysis of the deceleration of the impact trolley during the test, and analysis of the deformable barrier after the test, revealed that the \"&'General Overview'!C5&\" would be a \"&Datasheet!C28&\" impact partner in a frontal collision.\"","v":"Analysis of the deceleration of the impact trolley during the test, and analysis of the deformable barrier after the test, revealed that the  would be a benign impact partner in a frontal collision."}]
[null,"FW",{"$f":"IF(C37=TRUE,\"In the full-width rigid barrier test, good protection was provided to all critical body areas of the driver and rear passenger, and the \"&'General Overview'!C5&\" scored maximum points in this part of the assessment\",IF(NOT(C36=TRUE),\"In the full-width rigid barrier test, good or adequate protection was provided to all critical body areas, for both the driver and rear passenger.\",\"FW COMMENT\"))","v":"FW COMMENT"}]
[null,"Side",{"$f":"IF(AND(D46:D49=\"Green\"),\"In the side barrier test, protection of all critical body areas was good and the car scored maximum points in this part of the assessment.\",IF(NOT(OR(D46:D49=\"Red\",D46:D49=\"Brown\",D46:D49=\"Orange\")),\"In the side barrier test, protection of all critical body areas was good or adequate.\",\"SIDE BARRIER COMMENTS\"))","v":"SIDE BARRIER COMMENTS"}]
[null,"Pole",{"$f":"IF(AND(D54:D57=\"Green\"),\"In the more severe side pole impact, protection of all critical body areas was good and the car scored maximum points in this part of the assessment.\",IF(NOT(OR(D54:D57=\"Red\",D54:D57=\"Brown\",D54:D57=\"Orange\")),\"In the more severe side pole impact, protection of all critical body areas was good or adequate.\",\"SIDE POLE COMMENTS\"))","v":"SIDE POLE COMMENTS"}]
[null,"Far-side",{"$f":"CONCATENATE(\"Control of excursion (the extent to which a body is thrown to the other side of the vehicle when it is hit from the far side) was found to be \"&VLOOKUP(C62,I62:J66,2))","v":{"$error":"#N/A"}}]
[null,null,{"$f":"IF('General Overview'!M33=\"Standard\",CONCATENATE(\"The \"&'General Overview'!C5&\" has a counter-measure to mitigate against occupant to occupant injuries in such impacts and this performed well in Euro NCAP's test.\"),CONCATENATE(\"The \"&'General Overview'!C5&\" does not have a counter-measure, such as a centre airbag, to mitigate against occupant to occupant injuries in such impacts.\"))","v":"The  does not have a counter-measure, such as a centre airbag, to mitigate against occupant to occupant injuries in such impacts."}]
[]
[null,"Whiplash",{"$f":"\"Tests on the front seats and head restraints demonstrated \"&E78&\" protection against whiplash injuries in the event of a rear-end collision.  A geometric analysis of the rear seats \"&E80&\"indicated \"&E79&\" whiplash protection.\"","v":"Tests on the front seats and head restraints demonstrated poor protection against whiplash injuries in the event of a rear-end collision.  A geometric analysis of the rear seats also indicated poor whiplash protection."}]
[null,"Rescue",{"$f":"IF('General Overview'!E35=\"Standard\",\"  The \"&'General Overview'!C5&\" has an advanced eCall system which alerts the emergency services in the event of a crash.\",\"eCall??\")","v":"eCall??"}]
[null,null,{"$f":"IF('General Overview'!E36=\"Standard\",\"  The car also has a system which applies the brakes after an impact, to avoid secondary collisions.\",\"MCB??\")","v":"MCB??"}]
[]
[]
[]
[]
[]
[]
[]
[]
[null,{"$f":"CONCATENATE(C458,\" \",C459,\" \",C460,\" \",C461,\" \",C462,\" \",C463,\" \",C464,\" \",C465,\" \",C466,\" \",C467,\" \",C469,\" \",C470,\" \",C471)","v":{"$error":"#N/A"}}]
[]
[]
[]
[]
[]
[]
[]
[]
[]
[null,"COP"]
[null,"Dynamic"]

{"sheet":"Version Control","index":24,"n_rows":25,"n_cols":4,"rows_kept":25,"cut":false,"hidden":false,"merged":[]}
["Version No.","Change(s)","Sheet, Cell","Comments"]
["2023 v1.0",null,null,"First non-draft published spreadsheet"]
["2023 v1.1","Calculation for dooring score changed","VRU AEB Cyclist, F63","AP 01/08/2023: Changed formula - information is not a pre-requisite to score points on retention"]
["2023 v1.1.1","'Import' schema imported & mapped to some cells","Several","Allows import of data from equipment matrix.  Macro available which changes xpath to 'Export'"]
[null,"Rear Whiplash image corrected (green was missing)","Overall Rating"]
["2024 v1.0","Drop-downs for Q6, Q10 head excursion","VRU COP Dynamic D22, F22","Prevents entry of nonsensical figures"]
[null,"New row for peak resultant g - Q6 and Q10","VRU COP Dynamic D19, F19"]
[null,"New row for peak resultant g - Q6 and Q11","VRU COP Dynamic D32, F32"]
[null,"New row for shoulder belt load - Q6 and Q12","VRU COP Dynamic D37, F37"]
[null,"New row for peak resultant g - Q6 and Q10","VRU COP Dynamic D50, F50"]
[null,"New row for peak resultant g - Q6 and Q10","VRU COP Dynamic D58, F58"]
[null,"New row for peak resultant g - Q6 and Q11","VRU COP Dynamic D61, F61"]
[null,"New row for pelvis 3ms exceedence - Q6 and Q12","VRU COP Dynamic D62, F62"]
[null,"Merged scores from Unintentional and Intentional load cases","VRU AEB Motorcyclist H53, L53"]
[null,"DAMAGE recorded in AE-MDB","AOP Side MDB D9"]
[null,"DAMAGE recorded in Side Pole","AOP Side Pole D10"]
[null,"Formulae changed to account for comma decimal separator","SA LSS D23, J23, D64, J64","Allows for point or comma separator"]
[null,"Reference to Pedestrian Score removed from DSM eligibility","SA OSM D23","Unclear why included originally"]
[null,"Reference to Pedestrian score added to VRU AEB Ped, Cyclist and PTW","VRU AEB Pedestrian D16","Makes more sense to include as eligibility criterion for VRU AEB"]
[null,null,"VRU AEB Bicyclist D15"]
[null,null,"VRU AEB Motorcyclist D15"]
[null,"Reference to Whiplash Front score included in AEB C-C","AE AEB Car-to-Car D15","Makes sense to include as eligibility criterion for AEB C-C"]
[null,"Include 'partially compliant' as comment for submergence","Datasheet C86 (hidden sheet)","For systems which meet only door opening OR window opening, better than 'Fail'"]
[null,"COP Vehicle Based ISO/B2 fixture installation - belted only","COP Vehicle Based Row 17","Monitor 2024, apply 2026"]
[null,"COP Vehicle Based ISO/B2 installation - belt and ISOFIX","COP Vehicle Based Row 24","Monitor 2024, apply 2027"]